Ethanol, 2-methoxy-
- Formula: C3H8O2
- Molecular weight: 76.0944
- IUPAC Standard InChIKey: XNWFRZJHXBZDAG-UHFFFAOYSA-N
- CAS Registry Number: 109-86-4
- Chemical structure:
- Other names: β-Methoxyethanol; Dowanol EM; Ethylene glycol monomethyl ether; Methoxyethanol; Methyl cellosolve; Monomethyl glycol; MECS; Poly-Solv EM; 1-Hydroxy-2-methoxyethane; 2-Methoxy-1-ethanol; 2-Methoxyethanol; HOCH2CH2OCH3; 2-Hydroxyethyl methyl ether; Aethylenglykol-monomethylaether; Ether monomethylique de l'ethylene-glycol; Ethylene glycol methyl ether; Glycol monomethyl ether; Glycolmethyl ether; Methoxyhydroxyethane; Methyl glycol; Methyl oxitol; Methylglykol; Metil cellosolve; Metoksyetylowy alkohol; Monomethyl ether of ethylene glycol; 2-Methoxy-aethanol; 2-Metossietanolo; EGME; Glycol ether EM; Jeffersol EM; Methylcelosolv; Methyl ethoxol; Prist; UN 1188; Methoxyethylene glycol; Ektasolve EM; 2-Methoxyethyl alcohol; Methyl icinol; 3-Oxa-1-butanol; Amsco-Solv EE; Monoethylene glycol methyl ether; NSC 1258; EGM; 2-methoxyethanol (methyl cellosolve)

Reaction thermochemistry data

Data compiled by: John E. Bartmess
Individual Reactions
C3H7O2- + =
By formula: C3H7O2- + H+ = C3H8O2
Quantity | Value | Units | Method | Reference | Comment |
---|---|---|---|---|---|
ΔrH° | 1564. ± 8.8 | kJ/mol | G+TS | Bartmess, Scott, et al., 1979 | gas phase; value altered from reference due to change in acidity scale |
Quantity | Value | Units | Method | Reference | Comment |
ΔrG° | 1535. ± 8.4 | kJ/mol | IMRE | Bartmess, Scott, et al., 1979 | gas phase; value altered from reference due to change in acidity scale |

Gas phase ion energetics data

Data evaluated as indicated in comments:
HL - Edward P. Hunter and Sharon G. Lias
Data compiled as indicated in comments:
B - John E. Bartmess
LLK - Sharon G. Lias, Rhoda D. Levin, and Sherif A. Kafafi
LBLHLM - Sharon G. Lias, John E. Bartmess, Joel F. Liebman, John L. Holmes, Rhoda D. Levin, and W. Gary Mallard
Quantity | Value | Units | Method | Reference | Comment |
---|---|---|---|---|---|
Proton affinity (review) | 768.8 | kJ/mol | N/A | Hunter and Lias, 1998 | HL |
Quantity | Value | Units | Method | Reference | Comment |
Gas basicity | 729.8 | kJ/mol | N/A | Hunter and Lias, 1998 | HL |
Ionization energy determinations
IE (eV) | Method | Reference | Comment |
---|---|---|---|
10.13 | PE | Kimura, Katsumata, et al., 1981 | LLK |
Appearance energy determinations
Ion | AE (eV) | Other Products | Method | Reference | Comment |
---|---|---|---|---|---|
C2H5O+ | 10.36 | CH2OH | EI | Lossing, 1977 | LLK |
C2H6O+ | 10.3 ± 0.2 | CH3O | EI | Burgers, Holmes, et al., 1983 | LBLHLM |
C2H6O+ | 10.45 ± 0.05 | CH2O | EI | Holmes, Lossing, et al., 1982 | LBLHLM |
C2H7O+ | 9.96 ± 0.05 | HCO | EI | Holmes and Lossing, 1984 | LBLHLM |
De-protonation reactions
C3H7O2- + =
By formula: C3H7O2- + H+ = C3H8O2
Quantity | Value | Units | Method | Reference | Comment |
---|---|---|---|---|---|
ΔrH° | 1564. ± 8.8 | kJ/mol | G+TS | Bartmess, Scott, et al., 1979 | gas phase; value altered from reference due to change in acidity scale; B |
Quantity | Value | Units | Method | Reference | Comment |
ΔrG° | 1535. ± 8.4 | kJ/mol | IMRE | Bartmess, Scott, et al., 1979 | gas phase; value altered from reference due to change in acidity scale; B |

Kovats' RI, non-polar column, isothermal

Column type | Active phase | Temperature (C) | I | Reference | Comment |
---|---|---|---|---|---|
Packed | SE-30 | 150. | 630. | Tiess, 1984 | Ar, Gas Chrom Q (80-100 mesh); Column length: 3. m |
Packed | Porapack Q | 200. | 588. | Goebel, 1982 | N2 |
Packed | Apiezon L | 120. | 591. | Bogoslovsky, Anvaer, et al., 1978 | Celite 545 |
Packed | Apiezon L | 160. | 595. | Bogoslovsky, Anvaer, et al., 1978 | Celite 545 |

Kovats' RI, non-polar column, temperature ramp

Column type | Active phase | I | Reference | Comment |
---|---|---|---|---|
Capillary | CBP-1 | 617. | Shimadzu, 2003 | 25. m/0.2 mm/0.25 μm, He, 50. C @ 5. min, 4. K/min; Tend: 200. C |

Kovats' RI, polar column, isothermal

Column type | Active phase | Temperature (C) | I | Reference | Comment |
---|---|---|---|---|---|
Capillary | Supelcowax-10 | 60. | 1184. | Castello, Vezzani, et al., 1991 | N2; Column length: 60. m; Column diameter: 0.75 mm |
Packed | Carbowax 20M | 75. | 1225. | Goebel, 1982 | N2, Kieselgur (60-100 mesh); Column length: 2. m |

Kovats' RI, polar column, temperature ramp

Column type | Active phase | I | Reference | Comment |
---|---|---|---|---|
Capillary | CBP-20 | 1180. | Shimadzu, 2003 | 25. m/0.2 mm/0.25 μm, He, 50. C @ 5. min, 4. K/min; Tend: 200. C |

Van Den Dool and Kratz RI, non-polar column, temperature ramp

Column type | Active phase | I | Reference | Comment |
---|---|---|---|---|
Capillary | Ultra-2 | 624. | Poskrobko, Linkiewicz, et al., 1994 | 25. m/0.32 mm/0.52 μm, H2, 8. K/min; Tstart: 50. C; Tend: 310. C |
Capillary | DB-5 | 635. | Olson, Wong, et al., 1987 | 30. m/0.32 mm/1.0 μm, 5. K/min; Tstart: 20. C; Tend: 200. C |

Van Den Dool and Kratz RI, non-polar column, custom temperature program

Column type | Active phase | I | Reference | Comment |
---|---|---|---|---|
Packed | SE-30 | 629. | Peng, Ding, et al., 1988 | Supelcoport; Chromosorb; Column length: 3.05 m; Program: 40C(5min) => 10C/min => 200C or 250C (60min) |
Packed | SE-30 | 629. | Peng, Ding, et al., 1988 | Supelcoport; Chromosorb; Column length: 3.05 m; Program: 40C(5min) => 10C/min => 200C or 250C (60min) |

Normal alkane RI, non-polar column, isothermal

Column type | Active phase | Temperature (C) | I | Reference | Comment |
---|---|---|---|---|---|
Capillary | DB-1 | 60. | 618. | Shimadzu, 2003, 2 | 60. m/0.32 mm/1. μm, He |
Packed | DC-400 | 150. | 646. | Anderson, 1968 | Helium, Gas-Pak (60-80 mesh); Column length: 3.0 m |

Normal alkane RI, non-polar column, temperature ramp

Column type | Active phase | I | Reference | Comment |
---|---|---|---|---|
Capillary | Ultra-ALLOY-5 | 626. | Tsuge, Ohtan, et al., 2011 | 30. m/0.25 mm/0.25 μm, 40. C @ 2. min, 20. K/min, 320. C @ 13. min |
Capillary | OV-101 | 623. | Zenkevich, 2005 | 25. m/0.20 mm/0.10 μm, N2/He, 6. K/min; Tstart: 50. C; Tend: 250. C |
Capillary | BP-1 | 616. | Health Safety Executive, 2000 | 50. m/0.22 mm/0.75 μm, He, 5. K/min; Tstart: 50. C; Tend: 200. C |
Capillary | DB-5 | 635.3 | Olson, Wong, et al., 1988 | 30. m/0.32 mm/1. μm, 5. K/min; Tstart: 20. C; Tend: 200. C |

Normal alkane RI, non-polar column, custom temperature program

Column type | Active phase | I | Reference | Comment |
---|---|---|---|---|
Capillary | SPB-1 | 617. | Flanagan, Streete, et al., 1997 | 60. m/0.53 mm/5. μm, He; Program: 40C(6min) => 5C/min => 80C => 10C/min => 200C |
Capillary | SPB-1 | 617. | Strete, Ruprah, et al., 1992 | 60. m/0.53 mm/5.0 μm, Helium; Program: 40 0C (6 min) 5 0C/min -> 80 0C 10 0C/min -> 200 0C |
Capillary | SPB-1 | 616. | Strete, Ruprah, et al., 1992 | 60. m/0.53 mm/5.0 μm, Helium; Program: not specified |
Capillary | OV-1 | 616. | Ramsey and Flanagan, 1982 | Program: not specified |

Normal alkane RI, polar column, isothermal

Column type | Active phase | Temperature (C) | I | Reference | Comment |
---|---|---|---|---|---|
Capillary | DB-Wax | 60. | 1202. | Shimadzu, 2003, 2 | 50. m/0.32 mm/1. μm, He |

Normal alkane RI, polar column, temperature ramp

Column type | Active phase | I | Reference | Comment |
---|---|---|---|---|
Capillary | DB-Wax | 1199. | Shimadzu, 2012 | 30. m/0.32 mm/0.50 μm, Helium, 4. K/min; Tstart: 40. C; Tend: 260. C |
Capillary | DB-Wax | 1199. | Shimadzu Corporation, 2003 | 30. m/0.32 mm/0.5 μm, He, 4. K/min; Tstart: 40. C; Tend: 260. C |

Normal alkane RI, polar column, custom temperature program

Column type | Active phase | I | Reference | Comment |
---|---|---|---|---|
Capillary | Carbowax 20M | 1172. | Ramsey and Flanagan, 1982 | Program: not specified |

Gas phase thermochemistry data

Data compiled as indicated in comments:
ALS - Hussein Y. Afeefy, Joel F. Liebman, and Stephen E. Stein
DRB - Donald R. Burgess, Jr.
Quantity | Value | Units | Method | Reference | Comment |
---|---|---|---|---|---|
ΔfH°gas | -376.9 ± 8.1 | kJ/mol | Cm | Guthrie, 1977 | Hydrolysis; ALS |
ΔfH°gas | -395.9 | kJ/mol | N/A | Simonetta, 1947 | Value computed using ΔfHliquid° value of -441.0 kj/mol from Simonetta, 1947 and ΔvapH° value of 45.1 kj/mol from Guthrie, 1977.; DRB |

Condensed phase thermochemistry data

Data compiled as indicated in comments:
ALS - Hussein Y. Afeefy, Joel F. Liebman, and Stephen E. Stein
DH - Eugene S. Domalski and Elizabeth D. Hearing
Quantity | Value | Units | Method | Reference | Comment |
---|---|---|---|---|---|
ΔfH°liquid | -422.0 ± 7.6 | kJ/mol | Cm | Guthrie, 1977 | Hydrolysis; ALS |
ΔfH°liquid | -441.0 | kJ/mol | Ccb | Simonetta, 1947 | Author value for hf298-condensed=-123 kcal/mol; ALS |
Quantity | Value | Units | Method | Reference | Comment |
ΔcH°liquid | -1880. | kJ/mol | Ccb | Simonetta, 1947 | Author value for hf298-condensed=-123 kcal/mol; Corresponding ΔfHºliquid = -439. kJ/mol (simple calculation by NIST; no Washburn corrections); ALS |
Constant pressure heat capacity of liquid
Cp,liquid (J/mol*K) | Temperature (K) | Reference | Comment |
---|---|---|---|
175.38 | 298.15 | Svoboda, Zabransky, et al., 1991 | T = 298 to 330 K. Cp(liq) = 84.235 + 0.3057(T/K) J/mol*K. Cp value calculated from equation.; DH |
176.6 | 298.15 | Roux, Perron, et al., 1978 | DH |
174.9 | 298.15 | Kusano, Suurkuusk, et al., 1973 | DH |

Phase change data

Data compiled as indicated in comments:
TRC - Thermodynamics Research Center, NIST Boulder Laboratories, Chris Muzny director
BS - Robert L. Brown and Stephen E. Stein
DRB - Donald R. Burgess, Jr.
AC - William E. Acree, Jr., James S. Chickos
ALS - Hussein Y. Afeefy, Joel F. Liebman, and Stephen E. Stein
Quantity | Value | Units | Method | Reference | Comment |
---|---|---|---|---|---|
Tboil | 397.5 ± 0.3 | K | AVG | N/A | Average of 8 values; Individual data points |
Quantity | Value | Units | Method | Reference | Comment |
Tc | 597.6 | K | N/A | Wilson, Wilson, et al., 1996 | Uncertainty assigned by TRC = 0.2 K; by a static method; TRC |
Tc | 571. | K | N/A | Steele, Chirico, et al., 1994 | Uncertainty assigned by TRC = 2. K; TRC |
Quantity | Value | Units | Method | Reference | Comment |
Pc | 52.85 | bar | N/A | Wilson, Wilson, et al., 1996 | Uncertainty assigned by TRC = 0.20 bar; by a static method; TRC |
Pc | 36.00 | bar | N/A | Steele, Chirico, et al., 1994 | Uncertainty assigned by TRC = 0.05 bar; TRC |
Quantity | Value | Units | Method | Reference | Comment |
ρc | 3.80 | mol/l | N/A | Wilson, Wilson, et al., 1996 | Uncertainty assigned by TRC = 0.09 mol/l; TRC |
ρc | 4.03 | mol/l | N/A | Steele, Chirico, et al., 1994 | Uncertainty assigned by TRC = 0.04 mol/l; TRC |
Quantity | Value | Units | Method | Reference | Comment |
ΔvapH° | 45.2 | kJ/mol | N/A | Majer and Svoboda, 1985 | |
ΔvapH° | 45.1 | kJ/mol | N/A | Guthrie, 1977 | DRB |
ΔvapH° | 45.2 ± 0.2 | kJ/mol | C | Kusano, Wadsö, et al., 1971 | AC |
Enthalpy of vaporization
ΔvapH (kJ/mol) | Temperature (K) | Method | Reference | Comment |
---|---|---|---|---|
37.54 | 397.3 | N/A | Majer and Svoboda, 1985 | |
43.0 | 361. | N/A | Marrufo, Loras, et al., 2010 | Based on data from 346. to 397. K.; AC |
42.8 | 348. | A | Stephenson and Malanowski, 1987 | Based on data from 333. to 423. K.; AC |
42.9 | 344. | N/A | Pick, Fried, et al., 1956 | Based on data from 329. to 396. K.; AC |
41.3 | 273. | V | Gallaugher and Hibbert, 1937 | ALS |
Antoine Equation Parameters
log10(P) = A − (B / (T + C))
P = vapor pressure (bar)
T = temperature (K)
View plot Requires a JavaScript / HTML 5 canvas capable browser.
Temperature (K) | A | B | C | Reference | Comment |
---|---|---|---|---|---|
329.3 to 396.7 | 5.06386 | 1853.556 | -30.838 | Pick, Fried, et al., 1956, 2 | Coefficents calculated by NIST from author's data. |

Henry's Law data

Data compiled by: Rolf Sander
Henry's Law constant (water solution)
kH(T) = k°H exp(d(ln(kH))/d(1/T) ((1/T) - 1/(298.15 K)))
k°H = Henry's law constant for solubility in water at 298.15 K (mol/(kg*bar))
d(ln(kH))/d(1/T) = Temperature dependence constant (K)
k°H (mol/(kg*bar)) | d(ln(kH))/d(1/T) (K) | Method | Reference |
---|---|---|---|
0.022 | -870. | X | N/A |

References

Bartmess, Scott, et al., 1979
Bartmess, J.E.; Scott, J.A.; McIver, R.T., Jr.,
The gas phase acidity scale from methanol to phenol,
J. Am. Chem. Soc., 1979, 101, 6047. [all data]
Hunter and Lias, 1998
Hunter, E.P.; Lias, S.G.,
Evaluated Gas Phase Basicities and Proton Affinities of Molecules: An Update,
J. Phys. Chem. Ref. Data, 1998, 27, 3, 413-656, https://doi.org/10.1063/1.556018
. [all data]
Kimura, Katsumata, et al., 1981
Kimura, K.; Katsumata, S.; Achiba, Y.; Yamazaki, T.; Iwata, S.,
Ionization energies, Ab initio assignments, and valence electronic structure for 200 molecules
in Handbook of HeI Photoelectron Spectra of Fundamental Organic Compounds, Japan Scientific Soc. Press, Tokyo, 1981. [all data]
Lossing, 1977
Lossing, F.P.,
Heats of formation of some isomeric [CnH2n+1]+ ions. Substitutional effects on ion stability,
J. Am. Chem. Soc., 1977, 99, 7526. [all data]
Burgers, Holmes, et al., 1983
Burgers, P.C.; Holmes, J.L.; Szulejko, J.E.; Mommers, A.A.; Terlouw, J.K.,
The gas phase ion chemistry of the acetyl cation and isomeric [C2H3O]+ ions. On the structure of the [C2H3O]+ daughter ions generated from the enol of acetone radical cation,
Org. Mass Spectrom., 1983, 18, 254. [all data]
Holmes, Lossing, et al., 1982
Holmes, J.L.; Lossing, F.P.; Terlouw, J.K.; Burgers, P.C.,
The radical cation [CH2OH2]+ and related stable gas phase ion-dipole complexes,
J. Am. Chem. Soc., 1982, 104, 2931. [all data]
Holmes and Lossing, 1984
Holmes, J.L.; Lossing, F.P.,
Heats of formation of organic radicals from appearance energies,
Int. J. Mass Spectrom. Ion Processes, 1984, 58, 113. [all data]
Tiess, 1984
Tiess, D.,
Gaschromatographische Retentionsindices von 125 leicht- bis mittelflüchtigen organischen Substanzen toxikologisch-analytischer Relevanz auf SE-30,
Wiss. Z. Wilhelm-Pieck-Univ. Rostock Math. Naturwiss. Reihe, 1984, 33, 6-9. [all data]
Goebel, 1982
Goebel, K.-J.,
Gaschromatographische Identifizierung Niedrig Siedender Substanzen Mittels Retentionsindices und Rechnerhilfe,
J. Chromatogr., 1982, 235, 1, 119-127, https://doi.org/10.1016/S0021-9673(00)95793-5
. [all data]
Bogoslovsky, Anvaer, et al., 1978
Bogoslovsky, Yu.N.; Anvaer, B.I.; Vigdergauz, M.S.,
Chromatographic constants in gas chromatography (in Russian), Standards Publ. House, Moscow, 1978, 192. [all data]
Shimadzu, 2003
Shimadzu,
Gas chromatography analysis of organic solvents using capillary columns (No. 2), 2003, retrieved from http://www.shimadzu.com/apps/form.cfm. [all data]
Castello, Vezzani, et al., 1991
Castello, G.; Vezzani, S.; Gerbino, T.,
Gas chromatographic separation and automatic identification of complex mixtures of organic solvents in indrustrial wates,
J. Chromatogr., 1991, 585, 2, 273-280, https://doi.org/10.1016/0021-9673(91)85088-W
. [all data]
Poskrobko, Linkiewicz, et al., 1994
Poskrobko, J.; Linkiewicz, M.; Jaworski, M.,
Analysis of high-boiling ethoxylates of methyl, ethyl and butyl alcohols, with the use of gas chromatography,
Chem. Anal. (Warsaw), 1994, 39, 2, 153-159. [all data]
Olson, Wong, et al., 1987
Olson, K.L.; Wong, C.A.; Fleck, L.L.; Lazar, D.F.,
Qualitative and Quantitative Determination of Solvent Formulations in Automotive Paints,
J. Chromatogr. Sci., 1987, 25, 9, 418-423, https://doi.org/10.1093/chromsci/25.9.418
. [all data]
Peng, Ding, et al., 1988
Peng, C.T.; Ding, S.F.; Hua, R.L.; Yang, Z.C.,
Prediction of Retention Indexes I. Structure-Retention Index Relationship on Apolar Columns,
J. Chromatogr., 1988, 436, 137-172, https://doi.org/10.1016/S0021-9673(00)94575-8
. [all data]
Shimadzu, 2003, 2
Shimadzu,
Gas chromatography analysis of organic solvents using capillary columns (No. 3), 2003, retrieved from http://www.shimadzu.com/apps/form.cfm. [all data]
Anderson, 1968
Anderson, D.G.,
USe of Kovats retention indices and response factors for the qualitative and quantitative analysis of coating solvents,
J. Paint Technol., 1968, 40, 527, 549-557. [all data]
Tsuge, Ohtan, et al., 2011
Tsuge, S.; Ohtan, H.; Watanabe, C.,
Pyrolysis - GC/MS Data Book of Synthetic Polymers, Elsevier, 2011, 420. [all data]
Zenkevich, 2005
Zenkevich, I.G.,
Experimentally measured retention indices., 2005. [all data]
Health Safety Executive, 2000
Health Safety Executive,
MDHS 96 Volatile organic compounds in air - Laboratory method using pumed solid sorbent tubes, solvent desorption and gas chromatography
in Methods for the Determination of Hazardous Substances (MDHS) guidance, Crown, Colegate, Norwich, 2000, 1-24, retrieved from http://www.hse.gov.uk/pubns/mdhs/pdfs/mdhs96.pdf. [all data]
Olson, Wong, et al., 1988
Olson, K.L.; Wong, C.A.; Fleck, L.L.; Lazar, D.F.,
Qualitative and quantitative determination of solvent formulations in automotive paints,
J. Coat. Technol., 1988, 60, 762, 45-50. [all data]
Flanagan, Streete, et al., 1997
Flanagan, R.J.; Streete, P.J.; Ramsey, J.D.,
Volatile Substance Abuse, UNODC Technical Series, No 5, United Nations, Office on Drugs and Crime, Vienna International Centre, PO Box 500, A-1400 Vienna, Austria, 1997, 56, retrieved from http://www.odccp.org/pdf/technicalseries1997-01-011.pdf. [all data]
Strete, Ruprah, et al., 1992
Strete, P.J.; Ruprah, M.; Ramsey, J.D.; Flanagan, R.J.,
Detection and identification of volatile substances by headspace capillary gas chromatography to aid the diagnosis of acute poisoning,
Analyst, 1992, 117, 7, 1111-1127, https://doi.org/10.1039/an9921701111
. [all data]
Ramsey and Flanagan, 1982
Ramsey, J.D.; Flanagan, R.J.,
Detection and Identification of Volatile Organic Compounds in Blood by Headspace Gas Chromatography as an Aid to the Diagnosis of Solvent Abuse,
J. Chromatogr., 1982, 240, 2, 423-444, https://doi.org/10.1016/S0021-9673(00)99622-5
. [all data]
Shimadzu, 2012
Shimadzu, Pharmaceutical Related,
Analysis of pharmaceutical residual solvent (observation of separation) (1) - GC, 2012, retrieved from www.shimadzu.ru/applications/Applicationspdf/GC/Pharma/Pharmaceutical residual solvents GC.pdf. [all data]
Shimadzu Corporation, 2003
Shimadzu Corporation,
Analysis of pharmaceutical residual solvent (observation of separation), 2003, retrieved from http://www.shimadzu.com.br/analitica/aplicacoes/book/pharm69.pdf. [all data]