N-(4-bromophenyl)-4H-3,1-benzothiazin-2-amine

Phase change data

Data compiled by: William E. Acree, Jr., James S. Chickos

Enthalpy of fusion

ΔfusH (kcal/mol) Temperature (K) Method Reference
5.86478.3DSCGondová and Kos¹aková, 2004

References

Gondová and Kos¹aková, 2004
Gondová, T.; Kos¹aková, D., Thermoanalytical study of cyclization reaction of some thioureates, Journal of Thermal Analysis and Calorimetry, 2004, 76, 1, 133-138, https://doi.org/10.1023/B:JTAN.0000027812.95695.d6 . [all data]