1-Bromo-2-(2-methoxyethoxy)benzene

Phase change data

Data compiled by: William E. Acree, Jr., James S. Chickos

Quantity Value Units Method Reference Comment
Δvap64.5 ± 0.3kJ/molGSDabrowska, Sporzynski, et al., 2006Based on data from 302. - 368. K.

References

Dabrowska, Sporzynski, et al., 2006
Dabrowska, Aldona; Sporzynski, Andrzej; Verevkin, Sergey P., Vapour pressures and enthalpies of vaporization of a series of aromatic ethers of mono-, di- and triethylene glycol, Fluid Phase Equilibria, 2006, 249, 1-2, 115-119, https://doi.org/10.1016/j.fluid.2006.09.001 . [all data]