Syn-7,14-dihydro-7,14-bis(2-propylidene)-1,6:8,13-bismethano[14]annulene

Gas phase ion energetics data

Data compiled by: Sharon G. Lias, John E. Bartmess, Joel F. Liebman, John L. Holmes, Rhoda D. Levin, and W. Gary Mallard

Ionization energy determinations

IE (eV) Method Reference Comment
7.3PEGleiter, Dobler, et al., 1987
7.5PEGleiter, Dobler, et al., 1987Vertical value

References

Gleiter, Dobler, et al., 1987
Gleiter, R.; Dobler, W.; Vogel, E.; Bohm, S.; Lex, J., Consequences of n/o interactions in bishomoanthraquinones and their dimethylene derivatives. A structural and PE spectroscopic study, J. Am. Chem. Soc., 1987, 109, 5156. [all data]