Butanoic acid, 3-methyl-, butyl ester
- Formula: C9H18O2
- Molecular weight: 158.2380
- IUPAC Standard InChIKey: AYWJSCLAAPJZEF-UHFFFAOYSA-N
- CAS Registry Number: 109-19-3
- Chemical structure:

Phase change data

Data compiled by: Thermodynamics Research Center, NIST Boulder Laboratories, Chris Muzny director
Quantity | Value | Units | Method | Reference | Comment |
---|---|---|---|---|---|
Tboil | 175.7 | K | N/A | Munch, 1926 | Uncertainty assigned by TRC = 0.3 K |

Kovats' RI, non-polar column, isothermal

Data compiled by: NIST Mass Spectrometry Data Center, William E. Wallace, director

Column type CapillaryCapillaryCapillaryCapillaryCapillary
Active phase SE-30SE-30SE-30SE-30SE-30
Column length (m) 25.25.25.25.25.
Carrier gas N2N2N2N2N2
Substrate
Column diameter (mm) 0.330.330.330.330.33
Phase thickness (μm)
Temperature (C) 100.120.140.60.80.
I 1029.1021.1043.1045.1039.
ReferenceHaken, Madden, et al., 1985Haken, Madden, et al., 1985Haken, Madden, et al., 1985Haken, Madden, et al., 1985Haken, Madden, et al., 1985
Comment MSDC-RI MSDC-RI MSDC-RI MSDC-RI MSDC-RI
Column type CapillaryPackedPackedPacked
Active phase OV-101SE-30SE-30SE-30
Column length (m) 15.3.73.3.7
Carrier gas   N2
Substrate  Celaton (62-72 mesh)Chromosorb W AW (60-80 mesh)Celite 560
Column diameter (mm) 0.22
Phase thickness (μm)
Temperature (C) 80.150.100.150.
I 1030.1021.1028.1030.
ReferenceKomárek, Hornová, et al., 1983Ashes and Haken, 1974Chastrette, Heintz, et al., 1974Germaine and Haken, 1969
Comment MSDC-RI MSDC-RI MSDC-RI MSDC-RI

Normal alkane RI, non-polar column, custom temperature program

Data compiled by: NIST Mass Spectrometry Data Center, William E. Wallace, director

Column type CapillaryCapillaryCapillaryCapillaryCapillary
Active phase SLB-5 MSSLB-5 MSSE-30DB-5MSSE-30
Column length (m) 30.30. 30.
Carrier gas HeliumHelium He
Substrate
Column diameter (mm) 0.250.25 0.25
Phase thickness (μm) 0.250.25 0.25
Program 50 0C 3 0C/min -> 250 0C (1 min) 10 0C/min -> 300 0C (5 min)not specifiednot specified40C => 2C/min => 60C => 4C/min => 260Cnot specified
I 1048.1048.1021.1047.1021.
ReferenceCosta, De Fina, et al., 2008Costa, De Fina, et al., 2008Liu, Liang, et al., 2007Maia, Andrade, et al., 2004Vinogradov, 2004
Comment MSDC-RI MSDC-RI MSDC-RI MSDC-RI MSDC-RI

Van Den Dool and Kratz RI, polar column, custom temperature program

Data compiled by: NIST Mass Spectrometry Data Center, William E. Wallace, director

Column type Capillary
Active phase DB-Wax
Column length (m) 30.
Carrier gas H2
Substrate
Column diameter (mm) 0.25
Phase thickness (μm) 0.25
Program 60 0C (3 min) 2 K/min -> 220 0C 5 K/min -> 250 0C (15 min)
I 1271.
ReferenceBoulanger and Crouzet, 2000
Comment MSDC-RI

References

Munch, 1926
Munch, J.C.,
The Refractometric Determination of Alcohols and Esters in Aqueous and in Cottonseed Oil Solutions,
J. Am. Chem. Soc., 1926, 48, 994-1003. [all data]