cyc-C2H4OFe

Vibrational and/or electronic energy levels

Data compiled by: Marilyn E. Jacox

State:   X

Vib.
sym.
 No.   Approximate
 type of mode
 cm-1   Med.   Method   References

1457.9 Ar IR Kafafi, Hauge, et al., 1987
1259.5 Ar IR Kafafi, Hauge, et al., 1987
1138.0 Ar IR Kafafi, Hauge, et al., 1987
1134.9 Ar IR Kafafi, Hauge, et al., 1987
836.0 Ar IR Kafafi, Hauge, et al., 1987
756.0 Ar IR Kafafi, Hauge, et al., 1987

Additional references: Jacox, 1994, page 378

References

Kafafi, Hauge, et al., 1987
Kafafi, Z.H.; Hauge, R.H.; Billups, W.E.; Margrave, J.L., Infrared spectroscopy and photochemistry of iron-ethylene oxide in cryogenic matrixes. The FTIR spectrum of vinyliron hydroxide, J. Am. Chem. Soc., 1987, 109, 16, 4775, https://doi.org/10.1021/ja00250a003 . [all data]

Jacox, 1994
Jacox, M.E., Vibrational and electronic energy levels of polyatomic transient molecules, American Chemical Society, Washington, DC, 1994, 464. [all data]