2(1H)-Pyridinone

Reaction thermochemistry data

Data compiled by: Hussein Y. Afeefy, Joel F. Liebman, and Stephen E. Stein

Individual Reactions

C5H5NO = pyridin-2-ol

By formula: C5H5NO = C5H5NO

Quantity Value Units Method Reference Comment
Δr1. ± 10.kJ/molKinBeak, Fry, et al., 1976gas phase

Gas phase ion energetics data

Data evaluated as indicated in comments:
L - Sharon G. Lias

Data compiled as indicated in comments:
LL - Sharon G. Lias and Joel F. Liebman
LLK - Sharon G. Lias, Rhoda D. Levin, and Sherif A. Kafafi

Quantity Value Units Method Reference Comment
IE (evaluated)8.938 ± 0.001eVN/AN/AL

Ionization energy determinations

IE (eV) Method Reference Comment
8.9384 ± 0.0006TEOzeki, Cockett, et al., 1995LL
9.28 ± 0.02EIGronneberg and Undheim, 1972LLK
9.11 ± 0.03PECook, El-Abbady, et al., 1977Vertical value; LLK

References

Beak, Fry, et al., 1976
Beak, P.; Fry, F.S., Jr.; Lee, J.; Steele, F., Equilibration studies. Protomeric equilibria of 2- and 4-Hydroxypyridines, 2- and 4-hydroxypyridines, 2- and 4-mercaptopyridines, and structurally related compounds in the gas phase, J. Am. Chem. Soc., 1976, 98, 171-179. [all data]