Morpholine, 4-methyl-

Phase change data

Data compiled as indicated in comments:
BS - Robert L. Brown and Stephen E. Stein
AC - William E. Acree, Jr., James S. Chickos

Quantity Value Units Method Reference Comment
Δvap39.5kJ/molN/ABelabbaci, Razzouk, et al., 2009Based on data from 273. - 353. K.; AC
Δvap39.8kJ/molN/ARazzouk, Hajjaji, et al., 2009Based on data from 273. - 353. K.; AC
Δvap38.2 ± 1.1kJ/molDSCRojas-Aguilar, Ginez-Carbajal, et al., 2005AC
Δvap39.6 ± 0.3kJ/molGSVerevkin, 1998Based on data from 274. - 304. K.; AC
Δvap39.4 ± 0.1kJ/molN/ACabani, Conti, et al., 1975Based on data from 276. - 319. K.; AC

Reduced pressure boiling point

Tboil (K) Pressure (bar) Reference Comment
388.71.00Weast and Grasselli, 1989BS

Enthalpy of vaporization

ΔvapH (kJ/mol) Temperature (K) Method Reference Comment
38.9313.N/ARazzouk, Hajjaji, et al., 2009Based on data from 273. - 353. K.; AC
33.6343.TGAAl-Najjar and Al-Sammerrai, 2007Based on data from 323. - 363. K.; AC
40.2 ± 0.3288.GSVerevkin, 1998Based on data from 274. - 304. K.; AC
38.4312.AStephenson and Malanowski, 1987Based on data from 297. - 389. K.; AC
40.0291.AStephenson and Malanowski, 1987Based on data from 276. - 390. K.; AC

Kovats' RI, non-polar column, isothermal

View large format table.

Column type Active phase Temperature (C) I Reference Comment
CapillaryOV-101110.788.Zhuravleva, 200050. m/0.3 mm/0.4 μm, He

Normal alkane RI, non-polar column, temperature ramp

View large format table.

Column type Active phase I Reference Comment
CapillaryHP-5787.Jung, Wichmann, et al., 199925. m/0.20 mm/0.33 μm, 50. C @ 3. min, 5. K/min; Tend: 180. C

Normal alkane RI, polar column, temperature ramp

View large format table.

Column type Active phase I Reference Comment
CapillaryCarbowax 20M1080.Liardon and Ledermann, 1980H2, 2. K/min; Column length: 39. m; Column diameter: 0.30 mm; Tstart: 60. C; Tend: 220. C

References

Belabbaci, Razzouk, et al., 2009
Belabbaci, Aouicha; Razzouk, Antonio; Mokbel, Ilham; Jose, Jacques; Negadi, Latifa, Isothermal Vapor-Liquid Equilibria of (Monoethanolamine + Water) and (4-Methylmorpholine + Water) Binary Systems at Several Temperatures, J. Chem. Eng. Data, 2009, 54, 8, 2312-2316, https://doi.org/10.1021/je800530u . [all data]

Razzouk, Hajjaji, et al., 2009
Razzouk, Antonio; Hajjaji, Ahmed; Mokbel, Ilham; Mougin, Pascal; Jose, Jacques, Experimental vapor pressures of 1,2-bis(dimethylamino)ethane, 1-methylmorpholine, 1,2-bis(2-aminoethoxy)ethane and N-benzylethanolamine between 273.18 and 364.97K, Fluid Phase Equilibria, 2009, 282, 1, 11-13, https://doi.org/10.1016/j.fluid.2009.04.006 . [all data]

Rojas-Aguilar, Ginez-Carbajal, et al., 2005
Rojas-Aguilar, A.; Ginez-Carbajal, F.; Orozco-Guareno, E.; Flores-Segura, H., Measurement of enthalpies of vaporization of volatile heterocyclic compounds by DSC, J Therm Anal Calorim, 2005, 79, 1, 95-100, https://doi.org/10.1007/s10973-004-0568-3 . [all data]

Verevkin, 1998
Verevkin, Sergey P., Thermochemistry of amines: strain in six-membered rings from experimental standard molar enthalpies of formation of morpholines and piperazines, The Journal of Chemical Thermodynamics, 1998, 30, 9, 1069-1079, https://doi.org/10.1006/jcht.1998.0371 . [all data]

Cabani, Conti, et al., 1975
Cabani, Sergio; Conti, G.; Giannessi, D.; Lepori, L., Thermodynamic study of aqueous dilute solutions of organic compounds. Part 3.---Morpholines and piperazines, J. Chem. Soc., Faraday Trans. 1, 1975, 71, 0, 1154, https://doi.org/10.1039/f19757101154 . [all data]

Weast and Grasselli, 1989
CRC Handbook of Data on Organic Compounds, 2nd Editon, Weast,R.C and Grasselli, J.G., ed(s)., CRC Press, Inc., Boca Raton, FL, 1989, 1. [all data]

Al-Najjar and Al-Sammerrai, 2007
Al-Najjar, Hazim; Al-Sammerrai, Dhoaib, Thermogravimetric determination of the heat of vaporization of some highly polar solvents, J. Chem. Technol. Biotechnol., 2007, 37, 3, 145-152, https://doi.org/10.1002/jctb.280370302 . [all data]

Stephenson and Malanowski, 1987
Stephenson, Richard M.; Malanowski, Stanislaw, Handbook of the Thermodynamics of Organic Compounds, 1987, https://doi.org/10.1007/978-94-009-3173-2 . [all data]