5,12-Naphthacenedione

Condensed phase thermochemistry data

Data compiled by: Hussein Y. Afeefy, Joel F. Liebman, and Stephen E. Stein

Quantity Value Units Method Reference Comment
Δcsolid-8368.916kJ/molCcbMagnus, 1956Corresponding Δfsolid = -143.41 kJ/mol (simple calculation by NIST; no Washburn corrections)

Phase change data

Data compiled by: Hussein Y. Afeefy, Joel F. Liebman, and Stephen E. Stein

Quantity Value Units Method Reference Comment
Δsub109.kJ/molCMagnus, 1956

Normal alkane RI, non-polar column, custom temperature program

View large format table.

Column type Active phase I Reference Comment
CapillaryMethyl Silicone2595.Oda, Yasuhara, et al., 199825. m/0.25 mm/0.25 μm, He; Program: 50 0C (2 min) 20 0C/min -> 160 0C 5 0C/min -> 210 0C 10 0C/min -> 300 0C

Lee's RI, non-polar column, temperature ramp

View large format table.

Column type Active phase I Reference Comment
CapillaryHP-5430.57Pedersen, Durant, et al., 200530. m/0.25 mm/0.25 μm, Helium, 50. C @ 1.5 min, 6. K/min, 310. C @ 10. min
CapillarySE-30426.25König, Balfanz, et al., 198330. m/0.32 mm/0.25 μm, He, 2. K/min; Tstart: 120. C; Tend: 280. C

Lee's RI, non-polar column, custom temperature program

View large format table.

Column type Active phase I Reference Comment
CapillaryDB-5428.0Lundstedt, Haglund, et al., 200330. m/0.25 mm/0.25 μm; Program: not specified

References

Magnus, 1956
Magnus, A., Die resonanzenergien der parachinone Aui grund der prazisionsmessungsen ihrer verbrennungswarmen durch herrn gerhard wittwer, Z. Phys. Chem. (Neue Folge), 1956, 9, 141-161. [all data]

Belaits, et al., 1986
Belaits, I.L., et al., Russian J. Phys. Chem., 1986, 60, 379. [all data]

Oda, Yasuhara, et al., 1998
Oda, J.; Yasuhara, A.; Matsunaga, K.; Saito, Y., Identification of polycyclic aromatic hydrocarbons of the particulate accumulated in the tunnel duct of freeway and generation of their oxygenated derivatives, Jpn. J. Toxicol. Environ. Health, 1998, 44, 5, 334-351, https://doi.org/10.1248/jhs1956.44.334 . [all data]

Pedersen, Durant, et al., 2005
Pedersen, D.U.; Durant, J.L.; Taghizadeh, K.; Hemond, H.F.; Lafleur, A.L.; Cass, G.R., Human cell mutagenes in respirable airborne particles from the Northeastern United States. 2. Quantification of mutagenes and other organic compounds., Environ. Sci. Technol., 2005, 39, 24, 9547-9560, https://doi.org/10.1021/es050886c . [all data]

König, Balfanz, et al., 1983
König, J.; Balfanz, E.; Funcke, W.; Romanowski, T., Determination of oxygenated polycyclic aromatic hydrocarbons in airborne particulate matter by capillary gas chromatography and gas chromatography/mass spectrometry, Anal. Chem., 1983, 55, 4, 599-603, https://doi.org/10.1021/ac00255a004 . [all data]

Lundstedt, Haglund, et al., 2003
Lundstedt, S.; Haglund, P.; Öberg, L., Degradation and formation of polycyclic aromatic compounds during bioslurry treatment of an aged gasworks soil, Environ. Toxicol. Chem., 2003, 22, 7, 1413-1420, https://doi.org/10.1002/etc.5620220701 . [all data]