Methyltriphenyltin

Gas phase ion energetics data

Data compiled by: Henry M. Rosenstock, Keith Draxl, Bruce W. Steiner, and John T. Herron

Appearance energy determinations

Ion AE (eV) Other Products MethodReferenceComment
C18H15Sn+8.7 ± 0.2CH3EIChambers and Glockling, 1970

References

Chambers and Glockling, 1970
Chambers, D.B.; Glockling, F., Electron impact determination of heats of formation and bond energies in triphenyltin compounds, Inorg. Chim. Acta, 1970, 4, 150. [all data]