4-Amino-N-(4-ethylphenyl)benzenesulfonamide

Phase change data

Data compiled by: William E. Acree, Jr., James S. Chickos

Quantity Value Units Method Reference Comment
Δvap118.8kJ/molS-FPerlovich, Tkachev, et al., 2009
Quantity Value Units Method Reference Comment
Δsub143.6 ± 0.9kJ/molGSPerlovich, Tkachev, et al., 2009

Enthalpy of fusion

ΔfusH (kJ/mol) Temperature (K) Method Reference
36.3436.2DSCPerlovich, Tkachev, et al., 2009

References

Perlovich, Tkachev, et al., 2009
Perlovich, German L.; Tkachev, Valery V.; Strakhova, Nadezda N.; Kazachenko, Vladimir P.; Volkova, Tatyana V.; Surov, Oleg V.; Schaper, Klaus-Jürgen; Raevsky, Oleg A., Thermodynamic and structural aspects of sulfonamide crystals and solutions, J. Pharm. Sci., 2009, 98, 12, 4738-4755, https://doi.org/10.1002/jps.21784 . [all data]