Pyridine, 4-methyl-
- Formula: C6H7N
- Molecular weight: 93.1265
- IUPAC Standard InChIKey: FKNQCJSGGFJEIZ-UHFFFAOYSA-N
- CAS Registry Number: 108-89-4
- Chemical structure:

Gas phase thermochemistry data

Data compiled as indicated in comments:
ALS - Hussein Y. Afeefy, Joel F. Liebman, and Stephen E. Stein
DRB - Donald R. Burgess, Jr.
Quantity | Value | Units | Method | Reference | Comment |
---|---|---|---|---|---|
ΔfH°gas | 24.80 ± 0.22 | kcal/mol | Ccb | Good, 1972 | ALS |
ΔfH°gas | 24.41 ± 0.15 | kcal/mol | Cm | Andon, Cox, et al., 1957 | ALS |
ΔfH°gas | 24.43 ± 0.15 | kcal/mol | Ccb | Cox, Challoner, et al., 1954 | ALS |
ΔfH°gas | 22.2 | kcal/mol | N/A | Constam and White, 1903 | Value computed using ΔfHliquid° value of 48.1 kj/mol from Constam and White, 1903 and ΔvapH° value of 44.6 kj/mol from Good, 1972.; DRB |

Condensed phase thermochemistry data

Data compiled as indicated in comments:
ALS - Hussein Y. Afeefy, Joel F. Liebman, and Stephen E. Stein
DH - Eugene S. Domalski and Elizabeth D. Hearing
Quantity | Value | Units | Method | Reference | Comment |
---|---|---|---|---|---|
ΔfH°liquid | 14.15 ± 0.21 | kcal/mol | Ccb | Good, 1972 | ALS |
ΔfH°liquid | 13.57 ± 0.15 | kcal/mol | Ccb | Cox, Challoner, et al., 1954 | ALS |
ΔfH°liquid | 11.49 | kcal/mol | Ccb | Constam and White, 1903 | ALS |
Quantity | Value | Units | Method | Reference | Comment |
ΔcH°liquid | -817.56 ± 0.20 | kcal/mol | Ccb | Good, 1972 | ALS |
ΔcH°liquid | -816.99 ± 0.15 | kcal/mol | Ccb | Cox, Challoner, et al., 1954 | ALS |
ΔcH°liquid | -816.7 | kcal/mol | Ccb | Constam and White, 1903 | ALS |
Quantity | Value | Units | Method | Reference | Comment |
S°liquid | 49.9739 | cal/mol*K | N/A | Messerly, Todd, et al., 1988 | DH |
S°liquid | 49.766 | cal/mol*K | N/A | Messerly, Todd, et al., 1987 | DH |
S°liquid | 49.766 | cal/mol*K | N/A | Steele, Chirico, et al., 1986 | DH |
Constant pressure heat capacity of liquid
Cp,liquid (cal/mol*K) | Temperature (K) | Reference | Comment |
---|---|---|---|
37.9990 | 298.150 | Messerly, Todd, et al., 1988 | T = 10 to 400 K.; DH |
38.000 | 298.15 | Messerly, Todd, et al., 1987 | T = 10 to 410 K.; DH |
38.000 | 298.15 | Steele, Chirico, et al., 1986 | T = 10 to 410 K.; DH |

Phase change data

Data compiled as indicated in comments:
BS - Robert L. Brown and Stephen E. Stein
TRC - Thermodynamics Research Center, NIST Boulder Laboratories, Chris Muzny director
AC - William E. Acree, Jr., James S. Chickos
ALS - Hussein Y. Afeefy, Joel F. Liebman, and Stephen E. Stein
DRB - Donald R. Burgess, Jr.
DH - Eugene S. Domalski and Elizabeth D. Hearing
Quantity | Value | Units | Method | Reference | Comment |
---|---|---|---|---|---|
Tboil | 418. ± 1. | K | AVG | N/A | Average of 18 values; Individual data points |
Quantity | Value | Units | Method | Reference | Comment |
Tfus | 276.8 ± 0.8 | K | AVG | N/A | Average of 9 values; Individual data points |
Quantity | Value | Units | Method | Reference | Comment |
Ttriple | 276.800 | K | N/A | Messerly, Todd, et al., 1988, 2 | Crystal phase 1 phase; Uncertainty assigned by TRC = 0.03 K; TRC |
Ttriple | 276.810 | K | N/A | Messerly, Todd, et al., 1988, 2 | Crystal phase 1 phase; Uncertainty assigned by TRC = 0.02 K; TRC |
Ttriple | 276.8 | K | N/A | Soulard, Fillaux, et al., 1986 | Crystal phase 1 phase; Uncertainty assigned by TRC = 1. K; phases identified by Raman spectrum; TRC |
Quantity | Value | Units | Method | Reference | Comment |
Tc | 646. | K | N/A | Majer and Svoboda, 1985 | |
Tc | 646.3 | K | N/A | Kobe and Mathews, 1970 | Uncertainty assigned by TRC = 0.5 K; TRC |
Tc | 645.65 | K | N/A | Ambrose and Grant, 1957 | Uncertainty assigned by TRC = 0.5 K; TRC |
Quantity | Value | Units | Method | Reference | Comment |
Pc | 45.99 | atm | N/A | Kobe and Mathews, 1970 | Uncertainty assigned by TRC = 0.5000 atm; TRC |
Quantity | Value | Units | Method | Reference | Comment |
ρc | 3.07 | mol/l | N/A | Kobe and Mathews, 1970 | Uncertainty assigned by TRC = 0.21 mol/l; TRC |
Quantity | Value | Units | Method | Reference | Comment |
ΔvapH° | 10.7 ± 0.1 | kcal/mol | AVG | N/A | Average of 9 values; Individual data points |
Enthalpy of vaporization
ΔvapH (kcal/mol) | Temperature (K) | Method | Reference | Comment |
---|---|---|---|---|
8.965 | 418.5 | N/A | Majer and Svoboda, 1985 | |
10.4 ± 0.02 | 320. | EB | Chirico, Knipmeyer, et al., 1999 | Based on data from 328. to 459. K.; AC |
9.82 ± 0.02 | 360. | EB | Chirico, Knipmeyer, et al., 1999 | Based on data from 328. to 459. K.; AC |
9.27 ± 0.02 | 400. | EB | Chirico, Knipmeyer, et al., 1999 | Based on data from 328. to 459. K.; AC |
8.65 ± 0.05 | 440. | EB | Chirico, Knipmeyer, et al., 1999 | Based on data from 328. to 459. K.; AC |
9.89 | 363. | A | Stephenson and Malanowski, 1987 | Based on data from 348. to 460. K.; AC |
10.1 | 347. | A | Stephenson and Malanowski, 1987 | Based on data from 348. to 347. K.; AC |
9.56 | 396. | A | Stephenson and Malanowski, 1987 | Based on data from 381. to 460. K.; AC |
9.06 | 467. | A | Stephenson and Malanowski, 1987 | Based on data from 452. to 573. K.; AC |
8.89 | 579. | A | Stephenson and Malanowski, 1987 | Based on data from 564. to 646. K.; AC |
9.89 | 363. | EB,IP | Stephenson and Malanowski, 1987 | Based on data from 348. to 459. K. See also Osborn and Douslin, 1968.; AC |
10.5 ± 0.02 | 313. | C | Majer, Svoboda, et al., 1984 | AC |
10.3 ± 0.02 | 328. | C | Majer, Svoboda, et al., 1984 | AC |
10.1 ± 0.02 | 343. | C | Majer, Svoboda, et al., 1984 | AC |
9.87 | 365. | MG | Herington and Martin, 1953 | Based on data from 350. to 418. K.; AC |
Enthalpy of vaporization
ΔvapH = A exp(-αTr)
(1 − Tr)β
ΔvapH =
Enthalpy of vaporization (at saturation pressure)
(kcal/mol)
Tr = reduced temperature (T / Tc)
View plot Requires a JavaScript / HTML 5 canvas capable browser.
Temperature (K) | 298. to 434. |
---|---|
A (kcal/mol) | 15.3 |
α | 0.5241 |
β | 0.1879 |
Tc (K) | 646. |
Reference | Majer and Svoboda, 1985 |
Antoine Equation Parameters
log10(P) = A − (B / (T + C))
P = vapor pressure (atm)
T = temperature (K)
View plot Requires a JavaScript / HTML 5 canvas capable browser.
Temperature (K) | A | B | C | Reference | Comment |
---|---|---|---|---|---|
348.20 to 459.07 | 4.1641 | 1482.84 | -62.407 | Osborn and Douslin, 1968 | |
350.06 to 418.61 | 4.16667 | 1484.484 | -62.229 | Herington and Martin, 1953, 2 | Coefficents calculated by NIST from author's data. |
Enthalpy of sublimation
ΔsubH (kcal/mol) | Temperature (K) | Method | Reference | Comment |
---|---|---|---|---|
15.0 | 226. | A | Stephenson and Malanowski, 1987 | Based on data from 213. to 239. K.; AC |
Temperature of phase transition
Ttrs (K) | Initial Phase | Final Phase | Reference | Comment |
---|---|---|---|---|
255.010 | crystaline, II | crystaline, I | Steele, Chirico, et al., 1986 | DH |
276.818 | crystaline, I | liquid | Steele, Chirico, et al., 1986 | DH |
Enthalpy of phase transition
ΔHtrs (kcal/mol) | Temperature (K) | Initial Phase | Final Phase | Reference | Comment |
---|---|---|---|---|---|
0.00 | 255.00 | crystaline, II | crystaline, I | Messerly, Todd, et al., 1988 | DH |
3.007238 | 276.818 | crystaline, I | liquid | Messerly, Todd, et al., 1988 | DH |
0.000020 | 255.010 | crystaline, II | crystaline, I | Messerly, Todd, et al., 1987 | DH |
3.0060 | 276.817 | crystaline, I | liquid | Messerly, Todd, et al., 1987 | DH |
Entropy of phase transition
ΔStrs (cal/mol*K) | Temperature (K) | Initial Phase | Final Phase | Reference | Comment |
---|---|---|---|---|---|
10.86 | 276.818 | crystaline, I | liquid | Messerly, Todd, et al., 1988 | DH |
10.86 | 276.817 | crystaline, I | liquid | Messerly, Todd, et al., 1987 | DH |

Reaction thermochemistry data

Data compiled as indicated in comments:
B - John E. Bartmess
RCD - Robert C. Dunbar
Individual Reactions
C6H6N- + =
By formula: C6H6N- + H+ = C6H7N
Quantity | Value | Units | Method | Reference | Comment |
---|---|---|---|---|---|
ΔrH° | 369.7 ± 5.1 | kcal/mol | G+TS | Meot-ner and Kafafi, 1988 | gas phase; anchored to 88MEO scale, not the "87 acidity scale". The Kiefer, Zhang, et al., 1997 BDE is for ortho.; B |
ΔrH° | 374.8 ± 3.1 | kcal/mol | G+TS | DePuy, Kass, et al., 1988 | gas phase; Acid: p-methylpyridine. Between iPrOH, MeCN.; B |
Quantity | Value | Units | Method | Reference | Comment |
ΔrG° | 362.9 ± 5.0 | kcal/mol | IMRB | Meot-ner and Kafafi, 1988 | gas phase; anchored to 88MEO scale, not the "87 acidity scale". The Kiefer, Zhang, et al., 1997 BDE is for ortho.; B |
ΔrG° | 368.0 ± 3.0 | kcal/mol | IMRB | DePuy, Kass, et al., 1988 | gas phase; Acid: p-methylpyridine. Between iPrOH, MeCN.; B |
By formula: Li+ + C6H7N = (Li+ • C6H7N)
Quantity | Value | Units | Method | Reference | Comment |
---|---|---|---|---|---|
ΔrH° | 46.9 ± 3.3 | kcal/mol | CIDT | Rodgers, 2001 | RCD |
By formula: Na+ + C6H7N = (Na+ • C6H7N)
Quantity | Value | Units | Method | Reference | Comment |
---|---|---|---|---|---|
ΔrH° | 31.9 ± 0.9 | kcal/mol | CIDT | Rodgers, 2001 | RCD |
By formula: K+ + C6H7N = (K+ • C6H7N)
Quantity | Value | Units | Method | Reference | Comment |
---|---|---|---|---|---|
ΔrH° | 23.6 ± 1.0 | kcal/mol | CIDT | Rodgers, 2001 | RCD |

Gas phase ion energetics data

Data evaluated as indicated in comments:
HL - Edward P. Hunter and Sharon G. Lias
Data compiled as indicated in comments:
B - John E. Bartmess
LLK - Sharon G. Lias, Rhoda D. Levin, and Sherif A. Kafafi
RDSH - Henry M. Rosenstock, Keith Draxl, Bruce W. Steiner, and John T. Herron
Quantity | Value | Units | Method | Reference | Comment |
---|---|---|---|---|---|
Proton affinity (review) | 226.4 | kcal/mol | N/A | Hunter and Lias, 1998 | HL |
Quantity | Value | Units | Method | Reference | Comment |
Gas basicity | 218.8 | kcal/mol | N/A | Hunter and Lias, 1998 | HL |
Ionization energy determinations
IE (eV) | Method | Reference | Comment |
---|---|---|---|
9.46 ± 0.05 | EI | Zaretskii, Oren, et al., 1976 | LLK |
9.5 ± 0.1 | EI | Stefanovic and Grutzmacher, 1974 | LLK |
9.55 ± 0.05 | EI | Distefano, Foffani, et al., 1971 | LLK |
9.55 | EI | Distefano, Foffani, et al., 1971, 2 | LLK |
9.04 ± 0.03 | PI | Watanabe, Nakayama, et al., 1962 | RDSH |
9.41 | PE | Klasinc, Novak, et al., 1978 | Vertical value; LLK |
9.50 ± 0.05 | PE | Heilbronner, Hornung, et al., 1972 | Vertical value; LLK |
Appearance energy determinations
Ion | AE (eV) | Other Products | Method | Reference | Comment |
---|---|---|---|---|---|
C5H6+ | 12.86 ± 0.05 | HCN | EI | Zaretskii, Oren, et al., 1976 | LLK |
C6H6N+ | 12.2 ± 0.1 | H | EI | Palmer and Lossing, 1963 | RDSH |
De-protonation reactions
C6H6N- + =
By formula: C6H6N- + H+ = C6H7N
Quantity | Value | Units | Method | Reference | Comment |
---|---|---|---|---|---|
ΔrH° | 369.7 ± 5.1 | kcal/mol | G+TS | Meot-ner and Kafafi, 1988 | gas phase; anchored to 88MEO scale, not the "87 acidity scale". The Kiefer, Zhang, et al., 1997 BDE is for ortho.; B |
ΔrH° | 374.8 ± 3.1 | kcal/mol | G+TS | DePuy, Kass, et al., 1988 | gas phase; Acid: p-methylpyridine. Between iPrOH, MeCN.; B |
Quantity | Value | Units | Method | Reference | Comment |
ΔrG° | 362.9 ± 5.0 | kcal/mol | IMRB | Meot-ner and Kafafi, 1988 | gas phase; anchored to 88MEO scale, not the "87 acidity scale". The Kiefer, Zhang, et al., 1997 BDE is for ortho.; B |
ΔrG° | 368.0 ± 3.0 | kcal/mol | IMRB | DePuy, Kass, et al., 1988 | gas phase; Acid: p-methylpyridine. Between iPrOH, MeCN.; B |

Ion clustering data

Data compiled by: Robert C. Dunbar
Clustering reactions
By formula: K+ + C6H7N = (K+ • C6H7N)
Quantity | Value | Units | Method | Reference | Comment |
---|---|---|---|---|---|
ΔrH° | 23.6 ± 1.0 | kcal/mol | CIDT | Rodgers, 2001 |
By formula: Li+ + C6H7N = (Li+ • C6H7N)
Quantity | Value | Units | Method | Reference | Comment |
---|---|---|---|---|---|
ΔrH° | 46.9 ± 3.3 | kcal/mol | CIDT | Rodgers, 2001 |
By formula: Na+ + C6H7N = (Na+ • C6H7N)
Quantity | Value | Units | Method | Reference | Comment |
---|---|---|---|---|---|
ΔrH° | 31.9 ± 0.9 | kcal/mol | CIDT | Rodgers, 2001 |

Kovats' RI, non-polar column, isothermal

Column type | Active phase | Temperature (C) | I | Reference | Comment |
---|---|---|---|---|---|
Packed | C78, Branched paraffin | 130. | 843.3 | Dallos, Sisak, et al., 2000 | He; Column length: 3.3 m |
Capillary | OV-101 | 110. | 864. | Golovnya, Kuz'menko, et al., 2000 | He; Phase thickness: 0.4 μm |
Capillary | OV-101 | 110. | 852. | Zhuravleva, 2000 | 50. m/0.3 mm/0.4 μm, He |
Capillary | OV-101 | 150. | 877. | Terenina, Zhuravieva, et al., 1997 | 50. m/0.3 mm/0.4 μm, He |
Packed | C78, Branched paraffin | 130. | 843.1 | Reddy, Dutoit, et al., 1992 | Chromosorb G HP; Column length: 3.3 m |
Packed | Apolane | 130. | 845. | Dutoit, 1991 | Column length: 3.7 m |
Capillary | SE-30 | 110. | 852. | Samusenko and Golovnya, 1988 | 25. m/0.32 mm/1. μm, He |
Capillary | SE-30 | 80. | 845. | Samusenko and Golovnya, 1988 | 25. m/0.32 mm/1. μm, He |
Capillary | OV-101 | 150. | 863. | Morishita, Morimoto, et al., 1986 | N2; Column length: 20. m; Column diameter: 0.23 mm |
Capillary | OV-101 | 80. | 846. | Samusenko, Svetlova, et al., 1986 | 25. m/0.25 mm/0.156 μm, He |
Capillary | OV-101 | 80. | 843. | Samusenko, Svetlova, et al., 1986 | 35. m/0.25 mm/0.125 μm, He |
Capillary | OV-101 | 80. | 843. | Samusenko, Svetlova, et al., 1986 | 35. m/0.25 mm/0.125 μm, He |
Capillary | OV-101 | 80. | 844. | Samusenko, Svetlova, et al., 1986 | 35. m/0.25 mm/0.125 μm, He |
Capillary | OV-101 | 80. | 846. | Samusenko, Svetlova, et al., 1986 | 50. m/0.25 mm/0.125 μm, He |
Packed | OV-1 | 120. | 860. | Valko, Papp, et al., 1984 | Gas Chrom Q; Column length: 2. m |
Packed | Apiezon L | 130. | 877. | Shatts, Avots, et al., 1977 | He, Chromosorb W AW-DMCS; Column length: 2.4 m |
Packed | Apolane | 70. | 823.2 | Riedo, Fritz, et al., 1976 | He, Chromosorb; Column length: 2.4 m |
Packed | Apiezon L | 100. | 857. | Zhuravleva, Kapustin, et al., 1976 | N2 or He, Chromosorb G, AW; Column length: 2.7 m |
Packed | Apiezon L | 110. | 865. | Bark and Wheatstone, 1974 | N2, Chromosorb W AW-DCMS; Column length: 2. m |
Packed | Apiezon L | 130. | 871. | Bark and Wheatstone, 1974 | N2, Chromosorb W AW-DCMS; Column length: 2. m |
Packed | Apiezon L | 150. | 881. | Bark and Wheatstone, 1974 | N2, Chromosorb W AW-DCMS; Column length: 2. m |
Packed | PMS-100 | 130. | 853. | Anderson, Jurel, et al., 1973 | He, Celite 545 (44-60 mesh); Column length: 3. m |
Packed | PMS-100 | 150. | 852. | Anderson, Jurel, et al., 1973 | He, Celite 545 (44-60 mesh); Column length: 3. m |
Packed | PMS-100 | 180. | 850. | Anderson, Jurel, et al., 1973 | He, Celite 545 (44-60 mesh); Column length: 3. m |

Kovats' RI, polar column, isothermal

Column type | Active phase | Temperature (C) | I | Reference | Comment |
---|---|---|---|---|---|
Capillary | PEG-40M | 150. | 1316. | Terenina, Zhuravieva, et al., 1997 | 50. m/0.3 mm/0.4 μm, He |
Capillary | PEG-40M | 110. | 1309. | Golovnya, Samusenko, et al., 1987 | He; Column length: 50. m; Column diameter: 0.3 mm |
Capillary | PEG-40M | 80. | 1289. | Golovnya, Samusenko, et al., 1987 | He; Column length: 50. m; Column diameter: 0.3 mm |
Packed | Carbowax 20M | 100. | 1303. | Bark and Wheatstone, 1974 | N2, Chromosorb W AW-DCMS; Column length: 2. m |
Packed | Carbowax 20M | 110. | 1310. | Bark and Wheatstone, 1974 | N2, Chromosorb W AW-DCMS; Column length: 2. m |
Packed | Carbowax 20M | 90. | 1297. | Bark and Wheatstone, 1974 | N2, Chromosorb W AW-DCMS; Column length: 2. m |
Packed | PEG-2000 | 150. | 1354. | Anderson, Jurel, et al., 1973 | He, Celite 545 (44-60 mesh); Column length: 3. m |
Packed | PEG-2000 | 152. | 1350. | Anderson, Jurel, et al., 1973 | He, Celite 545 (44-60 mesh); Column length: 3. m |

Van Den Dool and Kratz RI, non-polar column, temperature ramp

Column type | Active phase | I | Reference | Comment |
---|---|---|---|---|
Capillary | OV-1 | 832.7 | Gautzsch and Zinn, 1996 | 8. K/min; Tstart: 35. C; Tend: 300. C |
Capillary | OV-101 | 852. | Golovnya, Samusenko, et al., 1988 | He, 2. K/min; Column length: 50. m; Column diameter: 0.25 mm; Tstart: 100. C |
Capillary | OV-101 | 850. | Golovnya, Samusenko, et al., 1988 | He, 8. K/min; Column length: 50. m; Column diameter: 0.25 mm; Tstart: 70. C |
Capillary | OV-101 | 850. | Golovnya, Samusenko, et al., 1988 | He, 4. K/min; Column length: 50. m; Column diameter: 0.25 mm; Tstart: 80. C |
Capillary | DB-5 | 862. | Premecz and Ford, 1987 | He, 60. C @ 10. min, 10. K/min, 280. C @ 3. min; Column length: 30. m; Column diameter: 0.32 mm |
Capillary | DB-5 | 849. | Rostad and Pereira, 1986 | 30. m/0.26 mm/0.25 μm, He, 50. C @ 4. min, 6. K/min, 300. C @ 20. min |

Van Den Dool and Kratz RI, non-polar column, custom temperature program

Column type | Active phase | I | Reference | Comment |
---|---|---|---|---|
Capillary | DB-5MS | 865. | Varlet, Serot, et al., 2007 | 30. m/0.32 mm/0.5 μm, He; Program: 70C => 5C/min => 85C(1min) => 3C/min => 165C => 10C/min => 280C(3min) |

Van Den Dool and Kratz RI, polar column, temperature ramp

Column type | Active phase | I | Reference | Comment |
---|---|---|---|---|
Capillary | DB-Wax | 1346. | Malliaa, Fernandez-Garcia, et al., 2005 | 60. m/0.32 mm/1. μm, He, 45. C @ 1. min, 5. K/min, 250. C @ 12. min |
Capillary | CP-WAX 57CB | 1294. | Baltes and Mevissen, 1988 | He, 50. C @ 5. min, 2. K/min; Column length: 50. m; Column diameter: 0.24 mm; Tend: 210. C |
Capillary | PEG-40M | 1308. | Golovnya, Samusenko, et al., 1988 | 25. m/0.32 mm/0.80 μm, He, 2. K/min; Tstart: 100. C |
Capillary | PEG-40M | 1309. | Golovnya, Samusenko, et al., 1988 | 25. m/0.32 mm/0.80 μm, He, 8. K/min; Tstart: 70. C |
Capillary | PEG-40M | 1310. | Golovnya, Samusenko, et al., 1988 | 25. m/0.32 mm/0.80 μm, He, 8. K/min; Tstart: 70. C |
Capillary | PEG-40M | 1303. | Golovnya, Samusenko, et al., 1988 | 25. m/0.32 mm/0.80 μm, He, 4. K/min; Tstart: 80. C |
Capillary | CP-WAX 57CB | 1320. | Salter L.J., Mottram D.S., et al., 1988 | 60. C @ 5. min, 4. K/min; Column length: 50. m; Column diameter: 0.32 mm; Tend: 200. C |
Capillary | CP-WAX 57CB | 1320. | Whitfield, Mottram, et al., 1988 | He, 60. C @ 5. min, 4. K/min, 200. C @ 10. min; Column length: 50. m; Column diameter: 0.32 mm |
Capillary | CP-WAX 57CB | 1322. | Whitfield, Mottram, et al., 1988 | He, 60. C @ 5. min, 4. K/min, 200. C @ 10. min; Column length: 50. m; Column diameter: 0.32 mm |
Capillary | CAM | 1289. | Premecz and Ford, 1987 | He, 60. C @ 5. min, 5. K/min, 240. C @ 21. min; Column length: 15. m; Column diameter: 0.24 mm |

Normal alkane RI, non-polar column, temperature ramp

Column type | Active phase | I | Reference | Comment |
---|---|---|---|---|
Capillary | HP-5 | 867.8 | Leffingwell and Alford, 2005 | 60. m/0.32 mm/0.25 μm, He, 30. C @ 2. min, 2. K/min, 260. C @ 28. min |
Capillary | HP-5 | 864. | Kubec, Drhová, et al., 1998 | 30. m/0.25 mm/0.25 μm, N2, 40. C @ 3. min, 4. K/min, 240. C @ 10. min |
Capillary | DB-1 | 848. | Yu, Wu, et al., 1994 | 60. m/0.25 mm/1. μm, He, 40. C @ 5. min, 2. K/min, 260. C @ 60. min |
Capillary | DB-1 | 848. | Yu, Wu, et al., 1994 | 60. m/0.25 mm/1. μm, He, 40. C @ 5. min, 2. K/min, 260. C @ 60. min |
Capillary | DB-5 | 868. | Lee, Macku, et al., 1991 | 60. m/0.25 mm/0.25 μm, 40. C @ 5. min, 2. K/min; Tend: 250. C |
Capillary | OV-101 | 841. | Misharina, Golovnya, et al., 1991 | 50. m/0.32 mm/0.5 μm, He, 4. K/min; Tstart: 50. C; Tend: 250. C |

Normal alkane RI, non-polar column, custom temperature program

Column type | Active phase | I | Reference | Comment |
---|---|---|---|---|
Capillary | SE-30 | 876. | Li, Gao, et al., 2000 | Program: not specified |
Capillary | OV-1, SE-30, Methyl silicone, SP-2100, OV-101, DB-1, etc. | 832. | Waggott and Davies, 1984 | Hydrogen; Column length: 50. m; Column diameter: 0.32 mm; Program: not specified |

Normal alkane RI, polar column, temperature ramp

Column type | Active phase | I | Reference | Comment |
---|---|---|---|---|
Capillary | RTX-Wax | 1345. | Galindo-Cuspinera, Lubran, et al., 2002 | 60. m/0.25 mm/0.5 μm, He, 40. C @ 5. min, 5. K/min, 180. C @ 20. min |
Capillary | DB-Wax | 1298. | Horiuchi, Umano, et al., 1998 | 60. m/0.25 mm/1. μm, He, 3. K/min, 200. C @ 40. min; Tstart: 50. C |
Capillary | HP-Innowax | 1298. | Kubec, Drhová, et al., 1998 | 30. m/0.25 mm/0.25 μm, N2, 40. C @ 3. min, 4. K/min, 190. C @ 10. min |
Capillary | DB-Wax | 1298. | Umano, Hagi, et al., 1995 | He, 40. C @ 2. min, 2. K/min; Column length: 60. m; Column diameter: 0.25 mm; Tend: 200. C |

Normal alkane RI, polar column, custom temperature program

Column type | Active phase | I | Reference | Comment |
---|---|---|---|---|
Capillary | DB-Wax | 1300. | Peng, Yang, et al., 1991 | Program: not specified |
Capillary | Carbowax | 1296. | Baltes and Bochmann, 1987 | Program: not specified |
Capillary | Carbowax | 1296. | Baltes and Bochmann, 1987 | Program: not specified |
Capillary | Carbowax | 1297. | Baltes and Bochmann, 1987 | Program: not specified |

Lee's RI, non-polar column, temperature ramp

Column type | Active phase | I | Reference | Comment |
---|---|---|---|---|
Capillary | DB-5 | 131.86 | Rostad and Pereira, 1986 | 30. m/0.26 mm/0.25 μm, He, 50. C @ 4. min, 6. K/min, 300. C @ 20. min |

Henry's Law data

Data compiled by: Rolf Sander
Henry's Law constant (water solution)
kH(T) = k°H exp(d(ln(kH))/d(1/T) ((1/T) - 1/(298.15 K)))
k°H = Henry's law constant for solubility in water at 298.15 K (mol/(kg*bar))
d(ln(kH))/d(1/T) = Temperature dependence constant (K)
k°H (mol/(kg*bar)) | d(ln(kH))/d(1/T) (K) | Method | Reference |
---|---|---|---|
170. | 6600. | M | N/A |

References

Good, 1972
Good, W.D.,
Enthalpies of combustion of nine organic nitrogen compounds related to petroleum,
J. Chem. Eng. Data, 1972, 17, 28-31. [all data]
Andon, Cox, et al., 1957
Andon, R.J.L.; Cox, J.D.; Herington, E.F.G.; Martin, J.F.,
The second virial coefficients of pyridine and benzene, and certain of their methyl homologues,
Trans. Faraday Soc., 1957, 53, 1074. [all data]
Cox, Challoner, et al., 1954
Cox, J.D.; Challoner, A.R.; Meetham, A.R.,
The heats of combustion of pyridine and certain of its derivatives,
J. Chem. Soc., 1954, 265-271. [all data]
Constam and White, 1903
Constam, E.J.; White, J.,
Physico-chemical investigations in the pyridine series,
Am. Chem. J., 1903, 29, 1-49. [all data]
Messerly, Todd, et al., 1988
Messerly, J.F.; Todd, S.S.; Finke, H.L.; Good, W.D.; Gammon, B.E.,
Condensed-phase heat-capacity studies and derived thermodynamic properties for six cyclic nitrogen compounds,
J. Chem. Thermodynam., 1988, 20, 209-224. [all data]
Messerly, Todd, et al., 1987
Messerly, J.F.; Todd, S.S.; Finke, H.L.; Gammon, B.E.,
Thermodynamic properties of organic nitrogen compounds that occur in shale oil and heavy petroleum-topical report,
NIPER Report, 1987, 83, 37p. [all data]
Steele, Chirico, et al., 1986
Steele, W.V.; Chirico, R.D.; Collier, W.B.; Hossenlopp, I.A.; Nguyen, A.; Strube, M.M.,
Thermochemical and thermophysical properties of organic nitrogen compounds found in fossil materials,
NIPER Report, 1986, 188, 112p. [all data]
Messerly, Todd, et al., 1988, 2
Messerly, J.F.; Todd, s.S.; Finke, H.L.; Good, W.D.; Gammon, B.E.,
Condensed-phase heat-capacity studies and derived thermodynamic properties for six cyclic nitrogen compounds,
J. Chem. Thermodyn., 1988, 20, 209. [all data]
Soulard, Fillaux, et al., 1986
Soulard, L.; Fillaux, F.; Braathen, G.; Le Calve, N.; Pasquier, B.,
Rotational Dynamics of the Methyl Group in the 4-Methyl pyridine Crystal,
Chem. Phys. Lett., 1986, 125, 41. [all data]
Majer and Svoboda, 1985
Majer, V.; Svoboda, V.,
Enthalpies of Vaporization of Organic Compounds: A Critical Review and Data Compilation, Blackwell Scientific Publications, Oxford, 1985, 300. [all data]
Kobe and Mathews, 1970
Kobe, K.A.; Mathews, J.F.,
Critical Properties and Vapor Pressures of Some Organic Nitrogen and Oxygen Compounds,
J. Chem. Eng. Data, 1970, 15, 182. [all data]
Ambrose and Grant, 1957
Ambrose, D.; Grant, D.G.,
The Critical Temperatures of Some Hydrocarbons and Pyridine Bases,
Trans. Faraday Soc., 1957, 53, 771. [all data]
Chirico, Knipmeyer, et al., 1999
Chirico, R.D.; Knipmeyer, S.E.; Nguyen, A.; Steele, W.V.,
Thermodynamic properties of the methylpyridines. Part 2. Vapor pressures, heat capacities, critical properties, derived thermodynamic functions between the temperatures 250 K and 560 K, and equilibrium isomer distributions for all temperatures ≥250 K,
The Journal of Chemical Thermodynamics, 1999, 31, 3, 339-378, https://doi.org/10.1006/jcht.1998.0451
. [all data]
Stephenson and Malanowski, 1987
Stephenson, Richard M.; Malanowski, Stanislaw,
Handbook of the Thermodynamics of Organic Compounds, 1987, https://doi.org/10.1007/978-94-009-3173-2
. [all data]
Osborn and Douslin, 1968
Osborn, Ann G.; Douslin, Donald R.,
Vapor pressure relations of 13 nitrogen compounds related to petroleum,
J. Chem. Eng. Data, 1968, 13, 4, 534-537, https://doi.org/10.1021/je60039a024
. [all data]
Majer, Svoboda, et al., 1984
Majer, V.; Svoboda, V.; Lencka, M.,
Enthalpies of vaporization and cohesive energies of pyridine and isomeric methylpyridines,
J. Chem. Thermodyn., 1984, 16, 1019-1024. [all data]
Herington and Martin, 1953
Herington, E.F.G.; Martin, J.F.,
Vapour pressures of pyridine and its homologues,
Trans. Faraday Soc., 1953, 49, 154, https://doi.org/10.1039/tf9534900154
. [all data]
Herington and Martin, 1953, 2
Herington, E.F.G.; Martin, J.F.,
Vapour Pressures of Pyridine and its Homologues,
Trans. Faraday Soc., 1953, 49, 154-162, https://doi.org/10.1039/tf9534900154
. [all data]
Meot-ner and Kafafi, 1988
Meot-ner, M.; Kafafi, S.A.,
Carbon Acidities of Aromatic Compounds,
J. Am. Chem. Soc., 1988, 110, 19, 6297, https://doi.org/10.1021/ja00227a003
. [all data]
Kiefer, Zhang, et al., 1997
Kiefer, J.H.; Zhang, Q.; Kern, R.D.; Yao, J.; Jursic, B.,
Pyrolysis of Aromatic Azines: Pyrazine, Pyrimidine, and Pyridine,
J. Phys. Chem. A, 1997, 101, 38, 7061, https://doi.org/10.1021/jp970211z
. [all data]
DePuy, Kass, et al., 1988
DePuy, C.H.; Kass, S.R.; Bean, G.P.,
Formation and Reactions of Heteroaromatic Anions in the Gas Phase,
J. Org. Chem., 1988, 53, 19, 4427, https://doi.org/10.1021/jo00254a001
. [all data]
Rodgers, 2001
Rodgers, M.T.,
Substituent Effects in the Binding of Alkali Metal Ions to Pyridines, Studied by Threshold Collision-Induced Dissociation and ab Initio Theory: The Methylpyridines,
J. Phys. Chem. A, 2001, 105, 11, 2374, https://doi.org/10.1021/jp004055z
. [all data]
Hunter and Lias, 1998
Hunter, E.P.; Lias, S.G.,
Evaluated Gas Phase Basicities and Proton Affinities of Molecules: An Update,
J. Phys. Chem. Ref. Data, 1998, 27, 3, 413-656, https://doi.org/10.1063/1.556018
. [all data]
Zaretskii, Oren, et al., 1976
Zaretskii, Z.V.I.; Oren, D.; Kelner, L.,
Automatic method for the measurement of the electron impact ionization and appearance potentials,
Appl. Spectrosc., 1976, 30, 366. [all data]
Stefanovic and Grutzmacher, 1974
Stefanovic, D.; Grutzmacher, H.F.,
The ionisation potential of some substituted pyridines,
Org. Mass Spectrom., 1974, 9, 1052. [all data]
Distefano, Foffani, et al., 1971
Distefano, G.; Foffani, A.; Innorta, G.; Pignataro, S.,
Mass spectrometric study of transition metal complexes with ligands having nitrogen or sulphur as donor atom,
Adv. Mass Spectrom., 1971, 5, 696. [all data]
Distefano, Foffani, et al., 1971, 2
Distefano, G.; Foffani, A.; Innorta, G.; Pignataro, S.,
Electron impact ionization potentials of some manganese, chromium and tungsten organometallic derivatives,
Int. J. Mass Spectrom. Ion Phys., 1971, 7, 383. [all data]
Watanabe, Nakayama, et al., 1962
Watanabe, K.; Nakayama, T.; Mottl, J.,
Ionization potentials of some molecules,
J. Quant. Spectry. Radiative Transfer, 1962, 2, 369. [all data]
Klasinc, Novak, et al., 1978
Klasinc, L.; Novak, I.; Scholz, M.; Kluge, G.,
Photoelektronenspektren substituierter Pyridine und Benzole und ihre Interpretation durch die CNDO/SWW-Methode,
Croat. Chem. Acta, 1978, 51, 43. [all data]
Heilbronner, Hornung, et al., 1972
Heilbronner, E.; Hornung, V.; Pinkerton, F.H.; Thames, S.F.,
31. Photoelectron spectra of azabenzenes and azanaphthalenes: III. The orbital sequence in methyl- and trimethylsilyl- substituted pyridines,
Helv. Chim. Acta, 1972, 55, 289. [all data]
Palmer and Lossing, 1963
Palmer, T.F.; Lossing, F.P.,
Free radicals by mass spectrometry. XXX. Ionization potentials of anilino and 2-, 3-, and 4-pyridylmethyl radicals,
J. Am. Chem. Soc., 1963, 85, 1733. [all data]
Handa, Utena, et al., 1986
Handa, T.; Utena, Y.; Yajima, H.; Ishii, T.; Morita, H.,
Excimer emission in protonated pyridine systems. 1. Fluorescence spectroscopy of protonated pyridine and its methyl derivatives in rigid glass solution at 77 K,
J. Phys. Chem., 1986, 90, 2589-2596. [all data]
Dallos, Sisak, et al., 2000
Dallos, A.; Sisak, A.; Kulcsár, Z.; Kováts, E.,
Pair-wise interactions by gas chromatography VII. Interaction free enthalpies of solutes with secondary alcohol groups,
J. Chromatogr. A, 2000, 904, 2, 211-242, https://doi.org/10.1016/S0021-9673(00)00908-0
. [all data]
Golovnya, Kuz'menko, et al., 2000
Golovnya, R.V.; Kuz'menko, T.E.; Krikunova, N.I.,
The influence of alkyl substituents on the chromatographic indicator of self-association of N-containing heterocyclic compounds,
Russ. Chem. Bull. (Engl. Transl.), 2000, 49, 2, 321-324, https://doi.org/10.1007/BF02494681
. [all data]
Zhuravleva, 2000
Zhuravleva, I.L.,
Evaluation of the polarity and boiling points of nitrogen-containing heterocyclic compounds by gas chromatography,
Russ. Chem. Bull. (Engl. Transl.), 2000, 49, 2, 325-328, https://doi.org/10.1007/BF02494682
. [all data]
Terenina, Zhuravieva, et al., 1997
Terenina, M.B.; Zhuravieva, I.L.; Golovnya, R.V.,
Peculiar features of sorption of positional isomers of formyl-, acetyl-, and aminopyridines in capillary gas-liquid chromatography,
Russ. Chem. Bull. (Engl. Transl.), 1997, 46, 1, 86-89, https://doi.org/10.1007/BF02495353
. [all data]
Reddy, Dutoit, et al., 1992
Reddy, K.S.; Dutoit, J.-Cl.; Kovats, E. sz.,
Pair-wise interactions by gas chromatography. I. Interaction free enthalpies of solutes with non-associated primary alcohol groups,
J. Chromatogr., 1992, 609, 1-2, 229-259, https://doi.org/10.1016/0021-9673(92)80167-S
. [all data]
Dutoit, 1991
Dutoit, J.,
Gas chromatographic retention behaviour of some solutes on structurally similar polar and non-polar stationary phases,
J. Chromatogr., 1991, 555, 1-2, 191-204, https://doi.org/10.1016/S0021-9673(01)87179-X
. [all data]
Samusenko and Golovnya, 1988
Samusenko, A.L.; Golovnya, R.V.,
Prediction of the retention indices of methyl pyridines and pyrazines in capillary gas chromatography based on the non-linear additivity of the sorption energy,
Chromatographia, 1988, 25, 6, 531-535, https://doi.org/10.1007/BF02324828
. [all data]
Morishita, Morimoto, et al., 1986
Morishita, F.; Morimoto, S.; Kojima, T.,
Prediction of molecular structures of aza-arenes by retention indices and fluorescence spectra,
J. Hi. Res. Chromatogr. Chromatogr. Comm., 1986, 9, 11, 688-692, https://doi.org/10.1002/jhrc.1240091120
. [all data]
Samusenko, Svetlova, et al., 1986
Samusenko, A.L.; Svetlova, N.I.; Golovnya, R.V.,
Reproducible and durable glass capillary columns with hydrogenated apiezon-l and OV-101 for the analysis of polar substances,
Zh. Anal. Khim., 1986, 61, 1, 127-133. [all data]
Valko, Papp, et al., 1984
Valko, K.; Papp, O.; Darvas, F.,
Selection of Gas Chromatographic Stationary Phase Pairs for Characterization of the 1-Octanol-Water Partition Coefficient,
J. Chromatogr., 1984, 301, 355-364, https://doi.org/10.1016/S0021-9673(01)89210-4
. [all data]
Shatts, Avots, et al., 1977
Shatts, V.D.; Avots, A.A.; Belikov, V.A.,
Retention indices of alkylpyridines,
Zh. Anal. Khim., 1977, 32, 4, 631-638. [all data]
Riedo, Fritz, et al., 1976
Riedo, F.; Fritz, D.; Tarján, G.; Kováts, E.Sz.,
A tailor-made C87 hydrocarbon as a possible non-polar standard stationary phase for gas chromatography,
J. Chromatogr., 1976, 126, 63-83, https://doi.org/10.1016/S0021-9673(01)84063-2
. [all data]
Zhuravleva, Kapustin, et al., 1976
Zhuravleva, I.L.; Kapustin, Yu.P.; Golovnya, P.B.,
Retention indices of some isoaliphatic and heterocyclic nitrogenous bases,
Zh. Anal. Khim., 1976, 31, 1378-1380. [all data]
Bark and Wheatstone, 1974
Bark, L.S.; Wheatstone, K.C.,
Studies in the relationship between molecular structure and chromatographic behaviour. Gas chromatographic study of monoalkylpyridines,
J. Chromatogr., 1974, 92, 2, 281-289, https://doi.org/10.1016/S0021-9673(00)85738-6
. [all data]
Anderson, Jurel, et al., 1973
Anderson, A.; Jurel, S.; Shymanska, M.; Golender, L.,
Gas-liquid chromatography of some aliphatic and heterocyclic mono- and pollyfunctional amines. VII. Retention indices of amines in some polar and unpolar stationary phases,
Latv. PSR Zinat. Akad. Vestis Kim. Ser., 1973, 1, 51-63. [all data]
Golovnya, Samusenko, et al., 1987
Golovnya, R.V.; Samusenko, A.L.; Dmitriev, L.B.,
Predicting retention indices of methyl-substituted pyridines in gas capillary chromatogrpahy on the basis of the principle of the nonadditive change in the energy of sorption,
Izv. Akad. Nauk SSSR Ser. Khim., 1987, 10, 2234-2239. [all data]
Gautzsch and Zinn, 1996
Gautzsch, R.; Zinn, P.,
Use of incremental models to estimate the retention indexes of aromatic compounds,
Chromatographia, 1996, 43, 3/4, 163-176, https://doi.org/10.1007/BF02292946
. [all data]
Golovnya, Samusenko, et al., 1988
Golovnya, R.V.; Samusenko, A.L.; Lyapin, V.A.,
Prediction of linear temperature programmed retention indices of methylpyridines in capillary gas chromatography,
Zh. Anal. Khim., 1988, 63, 2, 311-317. [all data]
Premecz and Ford, 1987
Premecz, J.E.; Ford, M.E.,
Gas chromatographic separation of substituted pyridines,
J. Chromatogr., 1987, 388, 23-35, https://doi.org/10.1016/S0021-9673(01)94463-2
. [all data]
Rostad and Pereira, 1986
Rostad, C.E.; Pereira, W.E.,
Kovats and Lee retention indices determined by gas chromatography/mass spectrometry for organic compounds of environmental interest,
J. Hi. Res. Chromatogr. Chromatogr. Comm., 1986, 9, 6, 328-334, https://doi.org/10.1002/jhrc.1240090603
. [all data]
Varlet, Serot, et al., 2007
Varlet, V.; Serot, T.; Cardinal, M.; Knockaert, C.; Prost, C.,
Olfactometric Determination of the Most Potent Odor-Active Compounds in Salmon Muscle (Salmo salar) Smoked by Using Four Smoke Generation Techniques,
J. Agric. Food Chem., 2007, 55, 11, 4518-4525, https://doi.org/10.1021/jf063468f
. [all data]
Malliaa, Fernandez-Garcia, et al., 2005
Malliaa, S.; Fernandez-Garcia, E.; Bosset, J.O.,
Comparison of purge and trap and solid phase microextraction techniques for studying the volatile aroma compounds of three European PDO hard cheeses,
Int. Dairy J., 2005, 15, 6-9, 741-758, https://doi.org/10.1016/j.idairyj.2004.11.007
. [all data]
Baltes and Mevissen, 1988
Baltes, W.; Mevissen, L.,
Model reactions on roast aroma formation. VI. Volatile reaction products from the reaction of phenylalanine with glucose during cooking and roasting,
Z. Lebensm. Unters. Forsch., 1988, 187, 3, 209-214, https://doi.org/10.1007/BF01043341
. [all data]
Salter L.J., Mottram D.S., et al., 1988
Salter L.J.; Mottram D.S.; Whitfield,
Volatile compounds produces in Maillard reactions involving glycine, ribose and phospholid,
J. Sci. Food Agric., 1988, 46, 2, 227-242, https://doi.org/10.1002/jsfa.2740460211
. [all data]
Whitfield, Mottram, et al., 1988
Whitfield, F.B.; Mottram, D.S.; Brock, S.; Puckey, D.J.; Salter, L.J.,
Effect of Phospholipid on the Formation of Volatile Heterocyclic Compounds in Heated Aqueous Solutions of Amino Acids and Ribose,
J. Sci. Food Agric., 1988, 42, 3, 261-272, https://doi.org/10.1002/jsfa.2740420309
. [all data]
Leffingwell and Alford, 2005
Leffingwell, J.C.; Alford, E.D.,
Volatile constituents of Perique tobacco,
Electron. J. Environ. Agric. Food Chem., 2005, 4, 2, 899-915. [all data]
Kubec, Drhová, et al., 1998
Kubec, R.; Drhová, V.; Velísek, J.,
Thermal degradation of S-methylcysteine and its sulfoxide-important flavor precursors of Bassica and Allium vegetables,
J. Agric. Food Chem., 1998, 46, 10, 4334-4340, https://doi.org/10.1021/jf980379x
. [all data]
Yu, Wu, et al., 1994
Yu, T.-H.; Wu, C.-M.; Ho, C.-T.,
Volatile compounds generated from the thermal interaction of glucose and alliin or deoxyalliin in propylene glycol,
Food Chem., 1994, 51, 3, 281-286, https://doi.org/10.1016/0308-8146(94)90028-0
. [all data]
Lee, Macku, et al., 1991
Lee, S.-R.; Macku, C.; Shibamoto, T.,
Isolation and identification of headspace volatiles formed in heated butter,
J. Agric. Food Chem., 1991, 39, 11, 1972-1975, https://doi.org/10.1021/jf00011a017
. [all data]
Misharina, Golovnya, et al., 1991
Misharina, T.A.; Golovnya, R.V.; Charnomskii, V.V.,
Volatile components of boiled shrimp funchalia woodwardi and crab geryon maritae,
Zh. Anal. Khim., 1991, 46, 1421-1429. [all data]
Li, Gao, et al., 2000
Li, R.; Gao, S.-G.; Xiang, B.-R.,
Using improved BP neural network in predicting GC retention indices,
Computers appl. chem. (Chinese), 2000, 17, 1-2, 113-114. [all data]
Waggott and Davies, 1984
Waggott, A.; Davies, I.W.,
Identification of organic pollutants using linear temperature programmed retention indices (LTPRIs) - Part II, 1984, retrieved from http://dwi.defra.gov.uk/research/completed-research/reports/dwi0383.pdf. [all data]
Galindo-Cuspinera, Lubran, et al., 2002
Galindo-Cuspinera, V.; Lubran, M.B.; Rankin, S.A.,
Comparison of volatile compounds in water- and oil-soluble annatto (Bixa orellana L.) extracts,
J. Agric. Food Chem., 2002, 50, 7, 2010-2015, https://doi.org/10.1021/jf011325h
. [all data]
Horiuchi, Umano, et al., 1998
Horiuchi, M.; Umano, K.; Shibamoto, T.,
Analysis of volatile compounds formed from fish oil heated with cysteine and trimethylamine oxide,
J. Agric. Food Chem., 1998, 46, 12, 5232-5237, https://doi.org/10.1021/jf980482m
. [all data]
Umano, Hagi, et al., 1995
Umano, K.; Hagi, Y.; Nakahara, K.; Shyoji, A.; Shibamoto, T.,
Volatile chemicals formed in the headspace of a heated D-glucose/L-cysteine Maillard model system,
J. Agric. Food Chem., 1995, 43, 8, 2212-2218, https://doi.org/10.1021/jf00056a046
. [all data]
Peng, Yang, et al., 1991
Peng, C.T.; Yang, Z.C.; Ding, S.F.,
Prediction of rentention idexes. II. Structure-retention index relationship on polar columns,
J. Chromatogr., 1991, 586, 1, 85-112, https://doi.org/10.1016/0021-9673(91)80028-F
. [all data]
Baltes and Bochmann, 1987
Baltes, W.; Bochmann, G.,
Model reactions on roast aroma formations, V. Mass spectrometric identification of pyrifines, oxazoles, and carbocyclic compounds from the reaction of serine and threonine with sucrose under the conditions of coffee roasting,
Z. Lebensm. Unters. Forsch., 1987, 185, 1, 5-9, https://doi.org/10.1007/BF01083331
. [all data]