p-Dicyclohexylbenzene

Phase change data

Data compiled by: Thermodynamics Research Center, NIST Boulder Laboratories, Chris Muzny director

Quantity Value Units Method Reference Comment
Tfus370.9KN/AVdovtsova and Tsukervanik, 1954Uncertainty assigned by TRC = 6. K

In addition to the Thermodynamics Research Center (TRC) data available from this site, much more physical and chemical property data is available from the following TRC products:

References

Vdovtsova and Tsukervanik, 1954
Vdovtsova, E.A.; Tsukervanik, I.P., Condensation of Phenylaluminum Diiodide with Aromatic Halogen Compounds, Zh. Obshch. Khim., 1954, 24, 558. [all data]