Dimethylzinc dimethylselenium complex

Phase change data

Data compiled by: Eugene S. Domalski and Elizabeth D. Hearing

Enthalpy of fusion

ΔfusH (kJ/mol) Temperature (K) Reference Comment
14.442216.60Lebedev and Kulagina, 1990

Entropy of fusion

ΔfusS (J/mol*K) Temperature (K) Reference Comment
66.673216.60Lebedev and Kulagina, 1990

References

Lebedev and Kulagina, 1990
Lebedev, B.V.; Kulagina, T.G., Thermodynamics of (CH3)2ZnxSe(CH3)2 and (CH3)2ZnxTe(CH3)2 complexes from 0 to 330, J. Chem. Thermodynam., 1990, 22, 21-34. [all data]