Uranium monobromide

Gas phase ion energetics data

Data compiled by: Sharon G. Lias, John E. Bartmess, Joel F. Liebman, John L. Holmes, Rhoda D. Levin, and W. Gary Mallard

Ionization energy determinations

IE (eV) Method Reference
6.5 ± 0.3EILau and Hildenbrand, 1987

References

Lau and Hildenbrand, 1987
Lau, K.H.; Hildenbrand, D.L., Thermochemistry of the gaseous uranium bromides UBr through UBr5(a), J. Chem. Phys., 1987, 86, 2949. [all data]