Diisopropylamine

Gas phase thermochemistry data

Data compiled as indicated in comments:
ALS - Hussein Y. Afeefy, Joel F. Liebman, and Stephen E. Stein
DRB - Donald R. Burgess, Jr.

Quantity Value Units Method Reference Comment
Δfgas-136.3 ± 2.6kJ/molCcbRibeiro da Silva, Ribeiro da Silva, et al., 1997ALS
Δfgas-143.7kJ/molN/ALebedeva, Katin, et al., 1971Value computed using ΔfHliquid° value of -178.4±0.0 kj/mol from Lebedeva, Katin, et al., 1971 and ΔvapH° value of 34.7 kj/mol from Ribeiro da Silva, Ribeiro da Silva, et al., 1997.; DRB

Condensed phase thermochemistry data

Data compiled by: Hussein Y. Afeefy, Joel F. Liebman, and Stephen E. Stein

Quantity Value Units Method Reference Comment
Δfliquid-171.0 ± 2.6kJ/molCcbRibeiro da Silva, Ribeiro da Silva, et al., 1997
Δfliquid-178.4 ± 0.04kJ/molCcbLebedeva, Katin, et al., 1971
Quantity Value Units Method Reference Comment
Δcliquid-4333.8 ± 2.5kJ/molCcbRibeiro da Silva, Ribeiro da Silva, et al., 1997
Δcliquid-4326.30 ± 0.42kJ/molCcbLebedeva, Katin, et al., 1971

Reaction thermochemistry data

Data compiled by: John E. Bartmess

Individual Reactions

C6H14N- + Hydrogen cation = Diisopropylamine

By formula: C6H14N- + H+ = C6H15N

Quantity Value Units Method Reference Comment
Δr1632.6 ± 2.1kJ/molG+TSGrimm and Bartmess, 1992gas phase
Quantity Value Units Method Reference Comment
Δr1601.6 ± 1.7kJ/molIMREGrimm and Bartmess, 1992gas phase

References

Ribeiro da Silva, Ribeiro da Silva, et al., 1997
Ribeiro da Silva, M.A.V.; Ribeiro da Silva, M.D.M.C.; Luisa, M.; Gomes, A.C.N.; Johnson, M.; Pilcher, G., Enthalpies of combustion of di-n-propylamine, diisopropylamine, diisobutylamine, and di-sec-butylamine, J. Chem. Thermodyn., 1997, 29, 1025-1030. [all data]

Lebedeva, Katin, et al., 1971
Lebedeva, N.D.; Katin, Y.A.; Akhmedova, G.Y., Enthalpies of formation of dipropylamine, di-isopropylamine, dibutylamine, and di-isobutylamine, Russ. J. Phys. Chem. (Engl. Transl.), 1971, 45, 771-772. [all data]

Grimm and Bartmess, 1992
Grimm, D.T.; Bartmess, J.E., The Intrinsic (Gas Phase) Basicity of some Anions Commonly Used in Condensed-Phase Synthesis, J. Am. Chem. Soc., 1992, 114, 4, 1227, https://doi.org/10.1021/ja00030a016 . [all data]