Benzene, nonyl-

Kovats' RI, non-polar column, temperature ramp

Data compiled by: NIST Mass Spectrometry Data Center, William E. Wallace, director

Column type Capillary
Active phase OV-101
Column length (m) 110.
Carrier gas He
Substrate
Column diameter (mm) 0.25
Phase thickness (μm) 0.20
Tstart (C) 35.
Tend (C) 200.
Heat rate (K/min) 1.
Initial hold (min)
Final hold (min)
I 1555.
ReferenceHayes and Pitzer, 1982
Comment MSDC-RI

Phase change data

Data compiled as indicated in comments:
BS - Robert L. Brown and Stephen E. Stein
TRC - Thermodynamics Research Center, NIST Boulder Laboratories, Chris Muzny director
AC - William E. Acree, Jr., James S. Chickos

Quantity Value Units Method Reference Comment
Tboil552. ± 8.KAVGN/AAverage of 9 values; Individual data points
Quantity Value Units Method Reference Comment
Δvap17.7 ± 0.1kcal/molMMMokbel, Rauzy, et al., 1998Based on data from 304. - 466. K. See also Verevkin, Kozlova, et al., 2006.; AC
Δvap17.9kcal/molN/AReid, 1972AC

Enthalpy of vaporization

ΔvapH (kcal/mol) Temperature (K) Method Reference Comment
16.7331.GSAllemand, Jose, et al., 1986Based on data from 316. - 415. K.; AC

In addition to the Thermodynamics Research Center (TRC) data available from this site, much more physical and chemical property data is available from the following TRC products:

References

Hayes and Pitzer, 1982
Hayes, P.C., Jr.; Pitzer, E.W., Characterizing petroleum- and shale-derived jet fuel distillates via temperature-programmed Kováts indices, J. Chromatogr., 1982, 253, 179-198, https://doi.org/10.1016/S0021-9673(01)88376-X . [all data]