Propanediamide

Condensed phase thermochemistry data

Data compiled as indicated in comments:
ALS - Hussein Y. Afeefy, Joel F. Liebman, and Stephen E. Stein
DH - Eugene S. Domalski and Elizabeth D. Hearing

Quantity Value Units Method Reference Comment
Δfsolid-542.81 ± 0.53kJ/molCcrImamura, Takahashi, et al., 1989ALS
Δfsolid-546.1 ± 1.5kJ/molCcbTavernier and Lamouroux, 1955Reanalyzed by Cox and Pilcher, 1970, Original value = -542.8 ± 1.5 kJ/mol; ALS
Quantity Value Units Method Reference Comment
Δcsolid-1495.21 ± 0.26kJ/molCcrImamura, Takahashi, et al., 1989ALS
Δcsolid-1491.9 ± 1.5kJ/molCcbTavernier and Lamouroux, 1955Reanalyzed by Cox and Pilcher, 1970, Original value = -1495.2 ± 1.5 kJ/mol; ALS

Constant pressure heat capacity of solid

Cp,solid (J/mol*K) Temperature (K) Reference Comment
124.298.15Imamura, Takahashi, et al., 1989One temperature, estimated.; DH

Gas phase thermochemistry data

Data compiled by: Hussein Y. Afeefy, Joel F. Liebman, and Stephen E. Stein

Quantity Value Units Method Reference Comment
Δfgas-416.4 ± 0.4kJ/molCcrImamura, Takahashi, et al., 1989

Phase change data

Data compiled as indicated in comments:
ALS - Hussein Y. Afeefy, Joel F. Liebman, and Stephen E. Stein
DH - Eugene S. Domalski and Elizabeth D. Hearing
AC - William E. Acree, Jr., James S. Chickos
CAL - James S. Chickos, William E. Acree, Jr., Joel F. Liebman, Students of Chem 202 (Introduction to the Literature of Chemistry), University of Missouri -- St. Louis

Quantity Value Units Method Reference Comment
Δsub30.2 ± 0.1kcal/molCImamura, Takahashi, et al., 1989ALS

Enthalpy of sublimation

ΔsubH (kcal/mol) Temperature (K) Reference Comment
30.2103298.15Imamura, Takahashi, et al., 1989DH

Entropy of sublimation

ΔsubS (cal/mol*K) Temperature (K) Reference Comment
101.3298.15Imamura, Takahashi, et al., 1989DH

Enthalpy of fusion

ΔfusH (kcal/mol) Temperature (K) Method Reference Comment
7.134444.2DSCBadea, Gatta, et al., 2006AC
8.56443.N/ADomalski and Hearing, 1996AC

Entropy of fusion

ΔfusS (cal/mol*K) Temperature (K) Reference Comment
1.15393.Domalski and Hearing, 1996CAL
19.31443.

Enthalpy of phase transition

ΔHtrs (kcal/mol) Temperature (K) Initial Phase Final Phase Reference Comment
0.4541393.crystaline, IIcrystaline, ISakiyama and Imamura, 1989DH
8.5564443.crystaline, IliquidSakiyama and Imamura, 1989DH

Normal alkane RI, non-polar column, custom temperature program

View large format table.

Column type Active phase I Reference Comment
CapillaryDB-11125.Touafek, Nacer, et al., 200530. m/0.25 mm/0.25 μm, He; Program: 45C => 3C/min => 175C => 15C/min => 300C (15min)

References

Imamura, Takahashi, et al., 1989
Imamura, A.; Takahashi, K.; Murata, S.; Sakiyama, M., Standard enthalpies of formation of trimethyl cyanurate, malonamide, and 1,3-dimethyluracil, J. Chem. Thermodyn., 1989, 21, 237-246. [all data]

Tavernier and Lamouroux, 1955
Tavernier, P.; Lamouroux, M., Determinations calorimetriques relatives a douze substances organiques susceptibles d'utilisation dans les poudres, Mem. Poudres, 1955, 37, 197-206. [all data]

Cox and Pilcher, 1970
Cox, J.D.; Pilcher, G., Thermochemistry of Organic and Organometallic Compounds, Academic Press, New York, 1970, 1-636. [all data]