5,12,6,11-[1,4]-Butanediylidene-dibenzo[a,e]cyclooctene, 5,6,11,12-tetrahydro

Gas phase ion energetics data

Data compiled by: Sharon G. Lias, John E. Bartmess, Joel F. Liebman, John L. Holmes, Rhoda D. Levin, and W. Gary Mallard

Ionization energy determinations

IE (eV) Method Reference Comment
7.8PEFessner, Sedelmeier, et al., 1987
8.1PEFessner, Sedelmeier, et al., 1987Vertical value

References

Fessner, Sedelmeier, et al., 1987
Fessner, W.; Sedelmeier, G.; Knothe, L.; Prinzbach, H.; Ribs, G.; Yang, Z.; Kovac, B.; Heilbronner, E., 169. 'Face to face'-benzo-anellierte homologe Hypostrophene. Synthesen, rontgenstrukturanalysen und PE-spektren, Helv. Chim. Acta, 1987, 70, 83. [all data]