Hexanoic acid, 5-hexenyl ester

Normal alkane RI, polar column, temperature ramp

Data compiled by: NIST Mass Spectrometry Data Center, William E. Wallace, director

Column type CapillaryCapillaryCapillaryCapillary
Active phase Carbowax 20MCarbowax 20MCarbowax 20MCarbowax 20M
Column length (m) 50.50.50.50.
Carrier gas N2N2N2N2
Substrate
Column diameter (mm) 0.220.220.220.22
Phase thickness (μm)
Tstart (C) 80.80.80.80.
Tend (C) 200.200.200.200.
Heat rate (K/min) 3.3.3.3.
Initial hold (min)
Final hold (min)
I 1652.1657.1652.1657.
ReferenceMihara, Tateba, et al., 1988Mihara, Tateba, et al., 1988Mihara, Tateba, et al., 1987Mihara, Tateba, et al., 1987
Comment MSDC-RI MSDC-RI MSDC-RI MSDC-RI

References

Mihara, Tateba, et al., 1988
Mihara, S.; Tateba, H.; Nishimura, O.; Machii, Y.; Kishino, K., The volatile components of Chinese quince (Pseudocydonia sinensis Schneid) in Flavors and Fragrances: A World Perspective. Proceedings of the 10th International Congress of Essential Oils, Fragrances and Flavors, Lawrence,B.M.; Mookherjee,B.D.; Willis,B.J., ed(s)., Elsevier, New York, 1988, 537-550. [all data]

Mihara, Tateba, et al., 1987
Mihara, S.; Tateba, H.; Nishimura, O.; Machii, Y.; Kishino, K., Volatile components of Chinese quince (Pseudocydonia sinensis Schneid), J. Agric. Food Chem., 1987, 35, 4, 532-537, https://doi.org/10.1021/jf00076a023 . [all data]