Iron, [η-[(1,2,3,4-η:1,4-η)-1,3-butadiene-1,4-diyl]]hexacarbonyldi, (fe-fe)

Gas phase ion energetics data

Data compiled by: Sharon G. Lias, John E. Bartmess, Joel F. Liebman, John L. Holmes, Rhoda D. Levin, and W. Gary Mallard

Ionization energy determinations

IE (eV) Method Reference Comment
7.6PECasarin, Ajo, et al., 1987
8.09PECasarin, Ajo, et al., 1987Vertical value

References

Casarin, Ajo, et al., 1987
Casarin, M.; Ajo, D.; Vittadini, A.; Ellis, D.E.; Granozzi, G.; Beroncello, R.; Osella, D., Combined UV-PES and theoretical study of binuclear M2(CO)6(C4H4) complexes (M = Fe, Ru, Os), Inorg. Chem., 1987, 26, 2041. [all data]