N,N-Dimethylaminoethanol

Normal alkane RI, non-polar column, custom temperature program

Data compiled by: NIST Mass Spectrometry Data Center, William E. Wallace, director

Column type CapillaryCapillary
Active phase DB-1DB-1
Column length (m) 60.60.
Carrier gas
Substrate
Column diameter (mm) 0.250.25
Phase thickness (μm) 0.250.25
Program not specifiednot specified
I 706.708.
ReferenceKawai, Ishida, et al., 1991Kawai, Ishida, et al., 1991
Comment MSDC-RI MSDC-RI

Normal alkane RI, non-polar column, temperature ramp

Data compiled by: NIST Mass Spectrometry Data Center, William E. Wallace, director

Column type Capillary
Active phase OV-101
Column length (m) 25.
Carrier gas N2/He
Substrate
Column diameter (mm) 0.20
Phase thickness (μm) 0.10
Tstart (C) 50.
Tend (C) 250.
Heat rate (K/min) 6.
Initial hold (min)
Final hold (min)
I 710.
ReferenceZenkevich, 2005
Comment MSDC-RI

References

Kawai, Ishida, et al., 1991
Kawai, T.; Ishida, Y.; Kakiuchi, H.; Ikeda, N.; Higashida, T.; Nakamura, S., Flavor components of dried squid, J. Agric. Food Chem., 1991, 39, 4, 770-777, https://doi.org/10.1021/jf00004a031 . [all data]