1,2-Ethanediamine, N,N-dimethyl-

Condensed phase thermochemistry data

Data compiled by: Hussein Y. Afeefy, Joel F. Liebman, and Stephen E. Stein

Quantity Value Units Method Reference Comment
Δfliquid  CcbGutner, Lebedeva, et al., 1979uncertain value: -77.3 ± 0.5 kJ/mol; Undetermined error
Quantity Value Units Method Reference Comment
Δcliquid  CcbGutner, Lebedeva, et al., 1979uncertain value: -3891.1 ± 0.5 kJ/mol; Undetermined error

Phase change data

Data compiled by: Robert L. Brown and Stephen E. Stein

Quantity Value Units Method Reference Comment
Tboil378.2KN/AAldrich Chemical Company Inc., 1990

References

Gutner, Lebedeva, et al., 1979
Gutner, N.M.; Lebedeva, N.D.; Kiseleva, N.N., Enthalpies of combustion and formation of some acyl-substituted diamines, Termodin. Org. Soedin., 1979, 97-98. [all data]

Aldrich Chemical Company Inc., 1990
Aldrich Chemical Company Inc., Catalog Handbook of Fine Chemicals, Aldrich Chemical Company, Inc., Milwaukee WI, 1990, 1. [all data]