3-Mercaptopropionic acid

Van Den Dool and Kratz RI, non-polar column, custom temperature program

View large format table.

Column type Active phase I Reference Comment
CapillarySE-541057.Hofmann and Schieberle, 199730. m/0.32 mm/0.25 μm, He; Program: 40C (2min) => 40C/min => 50C (5min) => 6C/min => 230C (15min)
CapillarySE-541057.Hofmann and Schieberle, 199530. m/0.32 mm/0.25 μm, He; Program: 40C (2min) => 40C/min => 50C (5min) => 6C/min => 230C (15min)

Van Den Dool and Kratz RI, polar column, custom temperature program

View large format table.

Column type Active phase I Reference Comment
CapillaryFFAP2193.Hofmann and Schieberle, 199730. m/0.32 mm/0.25 μm, He; Program: 40C (2min) => 40C/min => 60C (5min) => 6C/min => 230C (15min)
CapillaryFFAP2193.Hofmann and Schieberle, 199530. m/0.32 mm/0.25 μm, He; Program: 40C (2min) => 40C/min => 60C (5min) => 6C/min => 230C (15min)

Phase change data

Data compiled as indicated in comments:
BS - Robert L. Brown and Stephen E. Stein
AC - William E. Acree, Jr., James S. Chickos
DH - Eugene S. Domalski and Elizabeth D. Hearing

Reduced pressure boiling point

Tboil (K) Pressure (bar) Reference Comment
384.20.020Weast and Grasselli, 1989BS
358.70.004Weast and Grasselli, 1989BS

Enthalpy of fusion

ΔfusH (kJ/mol) Temperature (K) Reference Comment
16.97291.9Domalski and Hearing, 1996AC
16.974291.9Huffman and Ellis, 1935DH

Entropy of fusion

ΔfusS (J/mol*K) Temperature (K) Reference Comment
58.2291.9Huffman and Ellis, 1935DH

Reaction thermochemistry data

Data compiled by: John E. Bartmess

Individual Reactions

C3H5O2S- + Hydrogen cation = 3-Mercaptopropionic acid

By formula: C3H5O2S- + H+ = C3H6O2S

Quantity Value Units Method Reference Comment
Δr339.4 ± 2.2kcal/molG+TSCaldwell, Renneboog, et al., 1989gas phase
Quantity Value Units Method Reference Comment
Δr332.4 ± 2.0kcal/molIMRECaldwell, Renneboog, et al., 1989gas phase

References

Hofmann and Schieberle, 1997
Hofmann, T.; Schieberle, P., Identification of potent aroma compounds in thermally treated mixtures of glucose/cysteine and rhamnose/cysteine using aroma extract dilution techniques, J. Agric. Food Chem., 1997, 45, 3, 898-906, https://doi.org/10.1021/jf960456t . [all data]

Hofmann and Schieberle, 1995
Hofmann, T.; Schieberle, P., Evaluation of the key odorants in a thermally treated solution of ribose and cysteine by aroma extract dilution techniques, J. Agric. Food Chem., 1995, 43, 8, 2187-2194, https://doi.org/10.1021/jf00056a042 . [all data]