β-Alanine

Gas phase thermochemistry data

Data compiled by: Hussein Y. Afeefy, Joel F. Liebman, and Stephen E. Stein

Quantity Value Units Method Reference Comment
Δfgas-424. ± 2.kJ/molCcbSkoulika and Sabbah, 1983see Skoulika and Sabbah, 1982

Condensed phase thermochemistry data

Data compiled as indicated in comments:
ALS - Hussein Y. Afeefy, Joel F. Liebman, and Stephen E. Stein
DH - Eugene S. Domalski and Elizabeth D. Hearing

Quantity Value Units Method Reference Comment
Δfsolid-547.1 ± 1.1kJ/molCcbGerasimov, Geidarova, et al., 1988Uc =-18318.1±12.6 kJ/mol; ALS
Δfsolid-310. ± 1.5kJ/molCcbContineanu and Marchidan, 1984ALS
Δfsolid-558.04 ± 0.31kJ/molCcbSkoulika and Sabbah, 1983see Skoulika and Sabbah, 1982; ALS
Quantity Value Units Method Reference Comment
Δcsolid-1871. ± 1.5kJ/molCcbContineanu and Marchidan, 1984ALS
Δcsolid-1622.9 ± 0.23kJ/molCcbSkoulika and Sabbah, 1983see Skoulika and Sabbah, 1982; ALS

Constant pressure heat capacity of solid

Cp,solid (J/mol*K) Temperature (K) Reference Comment
109.298.Badelin, Kulikov, et al., 1990T = 298, 313, 333, 348 K.; DH
109.3298.Kulikov, Kozlov, et al., 1989T = 298 to 348 K.; DH
116.4298.Skoulika and Sabbah, 1983DH

Phase change data

Data compiled as indicated in comments:
ALS - Hussein Y. Afeefy, Joel F. Liebman, and Stephen E. Stein
AC - William E. Acree, Jr., James S. Chickos

Quantity Value Units Method Reference Comment
Δsub134. ± 2.kJ/molCSkoulika and Sabbah, 1983see Skoulika and Sabbah, 1982; ALS
Δsub134. ± 2.kJ/molCSkoulika and Sabbah, 1983AC

Enthalpy of sublimation

ΔsubH (kJ/mol) Temperature (K) Method Reference Comment
133.1 ± 0.7393.CSkoulika and Sabbah, 1983Based on data from 384. - 402. K.; AC

References

Skoulika and Sabbah, 1983
Skoulika, S.; Sabbah, R., Thermodynamique de composes azotes X. Etude thermochimique de quelques acides ω-amines, Thermochim. Acta, 1983, 61, 203-214. [all data]

Skoulika and Sabbah, 1982
Skoulika, S.; Sabbah, R., Enthalpy of formation of some ω-amino acids in the solid state, C. R. Seances Acad. Sci., Ser. 2, 1982, 295, 657-660. [all data]

Gerasimov, Geidarova, et al., 1988
Gerasimov, P.A.; Geidarova, E.L.; Gubareva, A.I.; Beregovykh, V.V.; Danilov, I.S., Energetic and transport properties of β-alanine, Khim.-Farm. Zh., 1988, 22, 1149-1150. [all data]

Contineanu and Marchidan, 1984
Contineanu, I.; Marchidan, D.I., The enthalpies of combustion and formation of D-alanine, L-alanine, DL-alanine, and β-alanine, Rev. Roum. Chim., 1984, 29, 43-48. [all data]

Badelin, Kulikov, et al., 1990
Badelin, V.G.; Kulikov, O.V.; Batagin, V.S.; Udzig, E.; Zielenkiewicz, A.; Zielenkiewicz, W.; Krestov, G.A., Physico-chemical properties of peptides and their solutions, Thermochim. Acta, 1990, 169, 81-93. [all data]

Kulikov, Kozlov, et al., 1989
Kulikov, O.V.; Kozlov, V.A.; Malenkina, L.I.; Badelin, V.G., Heat capacities of amino acids and peptides and excess characteristics ot their aqueous solutions, Sbornik Nauch. Trud., Termodin. Rast. neelect., Ivanovo, Inst. nevod. rast., 1989, Akad. [all data]