1(2H)-Naphthalenone, 3,4-dihydro-6-methoxy-
- Formula: C11H12O2
- Molecular weight: 176.2118
- IUPAC Standard InChIKey: MNALUTYMBUBKNX-UHFFFAOYSA-N
- CAS Registry Number: 1078-19-9
- Chemical structure:

Phase change data

Data compiled as indicated in comments:
BS - Robert L. Brown and Stephen E. Stein
AC - William E. Acree, Jr., James S. Chickos
Quantity | Value | Units | Method | Reference | Comment |
---|---|---|---|---|---|
ΔsubH° | 25.0 ± 0.2 | kcal/mol | C | Matos, Sousa, et al., 2009 | AC |
Reduced pressure boiling point
Tboil (K) | Pressure (atm) | Reference | Comment |
---|---|---|---|
444.2 | 0.014 | Weast and Grasselli, 1989 | BS |
Enthalpy of fusion
ΔfusH (kcal/mol) | Temperature (K) | Method | Reference | Comment |
---|---|---|---|---|
5.45 | 351.3 | DSC | Matos, Sousa, et al., 2009 | AC |

References

Matos, Sousa, et al., 2009
Matos, M. Agostinha R.; Sousa, Clara C.S.; Morais, Victor M.F.,
Thermochemical study of some methoxytetralones,
The Journal of Chemical Thermodynamics, 2009, 41, 1, 69-73, https://doi.org/10.1016/j.jct.2008.07.021
. [all data]
Weast and Grasselli, 1989
CRC Handbook of Data on Organic Compounds, 2nd Editon, Weast,R.C and Grasselli, J.G., ed(s)., CRC Press, Inc., Boca Raton, FL, 1989, 1. [all data]