2,3,4-Trimethylbenzoic acid

Gas phase ion energetics data

Data compiled by: John E. Bartmess

De-protonation reactions

C10H11O2- + Hydrogen cation = 2,3,4-Trimethylbenzoic acid

By formula: C10H11O2- + H+ = C10H12O2

Quantity Value Units Method Reference Comment
Δr1390. ± 8.4kJ/molIMREDecouzon, Gal, et al., 1997gas phase

Gas phase thermochemistry data

Data compiled by: Hussein Y. Afeefy, Joel F. Liebman, and Stephen E. Stein

Quantity Value Units Method Reference Comment
Δfgas-90.18 ± 0.43kcal/molCmColomina, Jimenez, et al., 1987see Colomina, Turrion, et al., 1964

Condensed phase thermochemistry data

Data compiled by: Hussein Y. Afeefy, Joel F. Liebman, and Stephen E. Stein

Quantity Value Units Method Reference Comment
Δfsolid-116.3 ± 0.43kcal/molCmColomina, Jimenez, et al., 1987see Colomina, Turrion, et al., 1964
Quantity Value Units Method Reference Comment
Δcsolid-1234.12 ± 0.22kcal/molCmColomina, Jimenez, et al., 1987see Colomina, Turrion, et al., 1964; Corresponding Δfsolid = -116.28 kcal/mol (simple calculation by NIST; no Washburn corrections)

References

Decouzon, Gal, et al., 1997
Decouzon, M.; Gal, J.-F.; Maria, P.-C.; Bohm, S.; Jimenez, P.; Roux, M.V.; Exner, O., Steric Effects in Crowded Molecules in the Gas Phase: Polymethyl Substituted Benzoic Acids, New J. Chem., 1997, 21, 561. [all data]