1,2,3,6,7,8-Hexahydro-as-indacene

Gas phase ion energetics data

Data compiled as indicated in comments:
LLK - Sharon G. Lias, Rhoda D. Levin, and Sherif A. Kafafi
RDSH - Henry M. Rosenstock, Keith Draxl, Bruce W. Steiner, and John T. Herron

Ionization energy determinations

IE (eV) Method Reference Comment
8.09PESantiago, Gandour, et al., 1978LLK
8.66 ± 0.02EIMeier, Heiss, et al., 1968RDSH

References

Santiago, Gandour, et al., 1978
Santiago, C.; Gandour, R.W.; Houk, K.N.; Nutakul, W.; Cravey, W.E.; Thummel, R.P., Photoelectron and ultraviolet spectra of small-ring fused aromatic molecules as probes of aromatic ring distortions, J. Am. Chem. Soc., 1978, 100, 3730. [all data]

Meier, Heiss, et al., 1968
Meier, H.; Heiss, J.; Suhr, H.; Muller, E., Energetische Untersuchungen zum Mills-Nixon-Effekt. Ionisierungsenergien von Benzolmolekulen mit ankondensierten gesattigten Ringen, Tetrahedron, 1968, 24, 2307. [all data]