endo,endo-Tetracyclo[6.2.1.1(3,6).0(2,7)]dodeca-4,9-diene

Reaction thermochemistry data

Data compiled by: Hussein Y. Afeefy, Joel F. Liebman, and Stephen E. Stein

Individual Reactions

endo,endo-Tetracyclo[6.2.1.1(3,6).0(2,7)]dodeca-4,9-diene + 2Hydrogen = 1,4:5,8-Dimethanonaphthalene, decahydro-, (1α,4α,4aα,5α,8α,8aα)-

By formula: C12H14 + 2H2 = C12H18

Quantity Value Units Method Reference Comment
Δr-255.4 ± 1.1kJ/molChydTurner, Jarrett, et al., 1973liquid phase; solvent: Acetic acid

References

Turner, Jarrett, et al., 1973
Turner, R.B.; Jarrett, A.D.; Goebel, P.; Mallon, B.J., Heats of hydrogenation. 9. Cyclic acetylenes and some miscellaneous olefins, J. Am. Chem. Soc., 1973, 95, 790-792. [all data]