1-Hexyn-3-ol, 3,5-dimethyl-

Normal alkane RI, non-polar column, custom temperature program

View large format table.

Column type Active phase I Reference Comment
CapillarySiloxane, 5 % Ph1414.VOC BinBase, 2012Program: not specified
CapillaryPolydimethyl siloxane, 5 % phenyl1414.Skogerson, Wohlgemuth, et al., 2011Program: not specified

References

VOC BinBase, 2012
VOC BinBase, The volatile compound BinBase (VOC BinBase), 2012, retrieved from http://fiehnlab.ucdavis.edu/projects/VocBinBase and http://binbase.sourceforge.net. [all data]

Skogerson, Wohlgemuth, et al., 2011
Skogerson, K.; Wohlgemuth, G.; Fiehn, O., VocBinNase, 2011, retrieved from http://fiehnlab.ucdavis.edu/projects//VocBinBase. [all data]