Cycloheptasiloxane, tetradecamethyl-

Van Den Dool and Kratz RI, non-polar column, temperature ramp

Data compiled by: NIST Mass Spectrometry Data Center, William E. Wallace, director

Column type Capillary
Active phase Ultra-1
Column length (m) 25.
Carrier gas He
Substrate
Column diameter (mm) 0.32
Phase thickness (μm) 0.52
Tstart (C) 35.
Tend (C) 320.
Heat rate (K/min) 15.
Initial hold (min)
Final hold (min) 10.
I 1519.
ReferenceRichmond and Pombo-Villar, 1998
Comment MSDC-RI

References

Richmond and Pombo-Villar, 1998
Richmond, R.; Pombo-Villar, E., Short communication. Use of persistent trace gas chromatography artifacts for the calculation of pseudo-Sadtler retention indices, J. Chromatogr. A, 1998, 811, 1-2, 241-245, https://doi.org/10.1016/S0021-9673(98)00285-4 . [all data]