4-Nitro-3-picoline-N-oxide
- Formula: C6H6N2O3
- Molecular weight: 154.1234
- IUPAC Standard InChIKey: SSOURMYKACOBIV-UHFFFAOYSA-N
- CAS Registry Number: 1074-98-2
- Chemical structure:

Phase change data

Data compiled by: William E. Acree, Jr., James S. Chickos
Quantity | Value | Units | Method | Reference | Comment |
---|---|---|---|---|---|
ΔsubH° | 106.7 ± 2.0 | kJ/mol | ME | Ribeiro da Silva, 1998 | Based on data from 345. to 392. K. |

References

Ribeiro da Silva, 1998
Ribeiro da Silva, M.,
Enthalpies of combustion of the pyridine N-oxide derivatives: 4-methyl-, 3-cyano-, 4-cyano-, 3-hydroxy-, 2-carboxy-, 4-carboxy-, and 3-methyl-4-nitro, and of the pyridine derivatives: 2-carboxy-, and 4-carboxy-. The dissociation enthalpies of the N-O bonds,
The Journal of Chemical Thermodynamics, 1998, 30, 7, 869-878, https://doi.org/10.1006/jcht.1998.0353
. [all data]