N-octanoyl-(dl)-leucine

Phase change data

Data compiled by: William E. Acree, Jr., James S. Chickos

Enthalpy of fusion

ΔfusH (kJ/mol) Temperature (K) Method Reference
27.2367.1DSCMiyagishi, Matsumura, et al., 1986

References

Miyagishi, Matsumura, et al., 1986
Miyagishi, Shigeyoshi; Matsumura, Seiichi; Asakawa, Tsuyoshi; Nishida, Morie, Phase transition of N-acyl amino acids with different acyl group., Bull. Chem. Soc. Jpn., 1986, 59, 2, 557-561, https://doi.org/10.1246/bcsj.59.557 . [all data]