Benzene, 1-bromo-3-fluoro-

Gas phase ion energetics data

Data compiled by: Sharon G. Lias, Rhoda D. Levin, and Sherif A. Kafafi

Ionization energy determinations

IE (eV) Method Reference Comment
9.11 ± 0.02PEMohraz, Maier, et al., 1980
9.25PEGounelle, Jullien, et al., 1975Vertical value

Phase change data

Data compiled by: Robert L. Brown and Stephen E. Stein

Quantity Value Units Method Reference Comment
Tboil423.KN/APCR Inc., 1990
Tboil423.2KN/AWeast and Grasselli, 1989

Kovats' RI, non-polar column, custom temperature program

View large format table.

Column type Active phase I Reference Comment
PackedApiezon M932.8Jalali-Heravi and Garkani-Nejad, 1993Chromosorb W; Column length: 2. m; Program: not specified

References

Mohraz, Maier, et al., 1980
Mohraz, M.; Maier, J.P.; Heilbronner, E., He(I α) and He(Iα) photoelectron spectra of fluorinated chloro- and bromobenzenes, J. Electron Spectrosc. Relat. Phenom., 1980, 19, 429. [all data]

Gounelle, Jullien, et al., 1975
Gounelle, Y.; Jullien, J.; Solgadi, D.; Botter, R.; Menes, F., No. 157. - Effets de l'isomerie sur les potentiels d'ionisation: Spectres des photoelectrons de dihalogeno-benzenes, J. Chim. Phys., 1975, 10, 1094. [all data]