Benzene, 1-bromo-2-fluoro-

Phase change data

Data compiled by: Robert L. Brown and Stephen E. Stein

Quantity Value Units Method Reference Comment
Tboil429.KN/APCR Inc., 1990

Gas phase ion energetics data

Data compiled by: Sharon G. Lias, Rhoda D. Levin, and Sherif A. Kafafi

Ionization energy determinations

IE (eV) Method Reference Comment
9.11 ± 0.02PEMohraz, Maier, et al., 1980
9.14PEGounelle, Jullien, et al., 1975Vertical value

Van Den Dool and Kratz RI, non-polar column, temperature ramp

Data compiled by: NIST Mass Spectrometry Data Center, William E. Wallace, director

Column type Packed
Active phase SE-30
Column length (m) 3.05
Carrier gas He
Substrate Supelcoport and Chromosorb
Column diameter (mm)
Phase thickness (μm)
Tstart (C) 40.
Tend (C) 250.
Heat rate (K/min) 10.
Initial hold (min) 4.
Final hold (min) 60.
I 934.
ReferencePeng, Ding, et al., 1988
Comment MSDC-RI

Kovats' RI, non-polar column, custom temperature program

View large format table.

Column type Active phase I Reference Comment
PackedApiezon M959.6Jalali-Heravi and Garkani-Nejad, 1993Chromosorb W; Column length: 2. m; Program: not specified

References

PCR Inc., 1990
PCR Inc., Research Chemicals Catalog 1990-1991, PCR Inc., Gainesville, FL, 1990, 1. [all data]

Mohraz, Maier, et al., 1980
Mohraz, M.; Maier, J.P.; Heilbronner, E., He(I α) and He(Iα) photoelectron spectra of fluorinated chloro- and bromobenzenes, J. Electron Spectrosc. Relat. Phenom., 1980, 19, 429. [all data]

Gounelle, Jullien, et al., 1975
Gounelle, Y.; Jullien, J.; Solgadi, D.; Botter, R.; Menes, F., No. 157. - Effets de l'isomerie sur les potentiels d'ionisation: Spectres des photoelectrons de dihalogeno-benzenes, J. Chim. Phys., 1975, 10, 1094. [all data]