cis 2-Butoxycinnamic acid

Condensed phase thermochemistry data

Data compiled by: Hussein Y. Afeefy, Joel F. Liebman, and Stephen E. Stein

Quantity Value Units Method Reference Comment
Δcsolid-6856.7kJ/molCcbRoth and Stoermer, 1913Corresponding Δfsolid = -545.6 kJ/mol (simple calculation by NIST; no Washburn corrections)

References

Roth and Stoermer, 1913
Roth, W.A.; Stoermer, R., Physikalisch-chemische untersuchungen an aromatischen stereoisomeren sauren 1, Chem. Ber., 1913, 40, 260-280. [all data]