2-Oxazolanone, 5-methyl-

Gas phase ion energetics data

Data compiled by: Sharon G. Lias, Rhoda D. Levin, and Sherif A. Kafafi

Ionization energy determinations

IE (eV) Method Reference Comment
9.99PEGerson, Worley, et al., 1978Vertical value

References

Gerson, Worley, et al., 1978
Gerson, S.H.; Worley, S.D.; Bodor, N.; Kaminski, J.J.; Flechtner, T.W., The photoelectron spectra of some heterocyclic compounds which contain N, O, Cl, and Br, J. Electron Spectrosc. Relat. Phenom., 1978, 13, 421. [all data]