1,3,2-Dithiastannolane,2,2-dimethyl-

Gas phase ion energetics data

Data compiled as indicated in comments:
LBLHLM - Sharon G. Lias, John E. Bartmess, Joel F. Liebman, John L. Holmes, Rhoda D. Levin, and W. Gary Mallard
LLK - Sharon G. Lias, Rhoda D. Levin, and Sherif A. Kafafi

Ionization energy determinations

IE (eV) Method Reference Comment
8.3PEAndoni, Cauletti, et al., 1983LBLHLM
8.70PEDelmas and Maire, 1978Vertical value; LLK

References

Andoni, Cauletti, et al., 1983
Andoni, E.; Cauletti, C.; Furlani, C., Electronic structure and bonding in 2,2-diphenyl-1,3-dithiacyclopentanes of IV a group elements studied by UV photoelectron spectroscopy, Inorg. Chim. Acta, 1983, 76, 35. [all data]

Delmas and Maire, 1978
Delmas, M.A.; Maire, J.C., Conformation du cycle dithia-1,3 stanna-2 cyclopentane: etude par RMN (1)H et par spectroscopie photoelectronique, J. Organomet. Chem., 1978, 161, 13. [all data]