Chloromethyl cyanide

Gas phase ion energetics data

Data evaluated as indicated in comments:
HL - Edward P. Hunter and Sharon G. Lias

Data compiled as indicated in comments:
B - John E. Bartmess
LLK - Sharon G. Lias, Rhoda D. Levin, and Sherif A. Kafafi
RDSH - Henry M. Rosenstock, Keith Draxl, Bruce W. Steiner, and John T. Herron

Quantity Value Units Method Reference Comment
Proton affinity (review)745.7kJ/molN/AHunter and Lias, 1998HL
Quantity Value Units Method Reference Comment
Gas basicity715.1kJ/molN/AHunter and Lias, 1998HL

Ionization energy determinations

IE (eV) Method Reference Comment
11.95 ± 0.01PEStaley, Kleckner, et al., 1976LLK
11.98PEBotter, Gounelle, et al., 1977Vertical value; LLK
12.05PELake and Thompson, 1970Vertical value; RDSH

De-protonation reactions

C2HClN- + Hydrogen cation = Chloromethyl cyanide

By formula: C2HClN- + H+ = C2H2ClN

Quantity Value Units Method Reference Comment
Δr1497. ± 9.2kJ/molG+TSPoutsma, Upshaw, et al., 2002gas phase; B
Δr1457. ± 29.kJ/molEIAEHacaloglu, Suzer, et al., 1988gas phase; From ClCH2CN. ΔGacid more likely to be ca. 360 - JEB.; B
Quantity Value Units Method Reference Comment
Δr1464. ± 8.4kJ/molIMRBPoutsma, Upshaw, et al., 2002gas phase; B
Δr1429. ± 33.kJ/molH-TSHacaloglu, Suzer, et al., 1988gas phase; From ClCH2CN. ΔGacid more likely to be ca. 360 - JEB.; B

References

Hunter and Lias, 1998
Hunter, E.P.; Lias, S.G., Evaluated Gas Phase Basicities and Proton Affinities of Molecules: An Update, J. Phys. Chem. Ref. Data, 1998, 27, 3, 413-656, https://doi.org/10.1063/1.556018 . [all data]

Staley, Kleckner, et al., 1976
Staley, R.H.; Kleckner, J.E.; Beauchamp, J.L., Relationship between orbital ionization energies and molecular properties. Proton affinities and photoelectron spectra of nitriles, J. Am. Chem. Soc., 1976, 98, 2081. [all data]

Botter, Gounelle, et al., 1977
Botter, R.; Gounelle, Y.; Henry, Y.; Jullien, J.; Menes, F.; Solgadi, D., Photoelectron spectra of halogeno-3-propynes (XCH2≡CH) and halogeno- methylcyanides (XCH2C≡N) and comments on the attribution of fluorine IP, J. Electron Spectrosc. Relat. Phenom., 1977, 10, 393. [all data]

Lake and Thompson, 1970
Lake, R.F.; Thompson, H., The photoelectron spectra of some molecules containing the C N group, Proc. Roy. Soc. (London), 1970, A317, 187. [all data]

Poutsma, Upshaw, et al., 2002
Poutsma, J.C.; Upshaw, S.D.; Squires, R.R.; Wenthold, P.G., Absolute heat of formation and singlet-triplet splitting for HCCN, J. Phys. Chem. A, 2002, 106, 6, 1067-1073, https://doi.org/10.1021/jp013653q . [all data]

Hacaloglu, Suzer, et al., 1988
Hacaloglu, J.; Suzer, S.; Oster, T.; Illenberger, E., Negative Ion Formation in Fluoroacetonitrile and Chloroacetonitrile following Low Energy Electron Impact, Chem. Phys. Lett., 1988, 153, 2-3, 268, https://doi.org/10.1016/0009-2614(88)85224-2 . [all data]