Hexamethyldistannathiane

Gas phase ion energetics data

Data compiled as indicated in comments:
LL - Sharon G. Lias and Joel F. Liebman
LLK - Sharon G. Lias, Rhoda D. Levin, and Sherif A. Kafafi

Ionization energy determinations

IE (eV) Method Reference Comment
7.8PECauletti, Grandinetti, et al., 1988LL
9.2 ± 0.1EIDistefano, Ricci, et al., 1974LLK
8.22PECauletti, Grandinetti, et al., 1988Vertical value; LL
8.22 ± 0.05PEDistefano, Ricci, et al., 1974, 2Vertical value; LLK

References

Cauletti, Grandinetti, et al., 1988
Cauletti, C.; Grandinetti, F.; Granozzi, G.; Sebald, A.; Wrackmeyer, B., Sn-S and Sn-Se bonding in some tin(IV) compounds studied by UV photoelectron and NMR spectroscopy and pseudopotential ab initio calculations, Organometallics, 1988, 7, 262. [all data]

Distefano, Ricci, et al., 1974
Distefano, G.; Ricci, A.; Danieli, R.; Foffani, A.; Innorta, G.; Torroni, S., Mass spectrometric evidence for p π-d π bonding between sulfur and the Group IVB elements, J. Organomet. Chem., 1974, 65, 205. [all data]

Distefano, Ricci, et al., 1974, 2
Distefano, G.; Ricci, A.; Colonna, F.P.; Pietropaolo, D.; Pignataro, S., Bonding between sulfur and the elements of Group IV studied by UV photoelectron spectroscopy, J. Organomet. Chem., 1974, 78, 93. [all data]