dilithium acetylide

Condensed phase thermochemistry data

Data compiled as indicated in comments:
MS - José A. Martinho Simões

Quantity Value Units Method Reference Comment
Δfsolid-15. ± 3.kcal/molAVGN/AAverage of 6 values; Individual data points
Quantity Value Units Method Reference Comment
solid13.97cal/mol*KReviewChase, 1998Data last reviewed in December, 1960

Solid Phase Heat Capacity (Shomate Equation)

Cp° = A + B*t + C*t2 + D*t3 + E/t2
H° − H°298.15= A*t + B*t2/2 + C*t3/3 + D*t4/4 − E/t + F − H
S° = A*ln(t) + B*t + C*t2/2 + D*t3/3 − E/(2*t2) + G
    Cp = heat capacity (cal/mol*K)
    H° = standard enthalpy (kcal/mol)
    S° = standard entropy (cal/mol*K)
    t = temperature (K) / 1000.

View plot Requires a JavaScript / HTML 5 canvas capable browser.

View table.

Temperature (K) 298. - 2000.
A 24.32500
B 2.465949
C -0.022879
D 0.006663
E -0.707509
F -23.94699
G 38.69180
H -14.20010
ReferenceChase, 1998
Comment Data last reviewed in December, 1960

References

Chase, 1998
Chase, M.W., Jr., NIST-JANAF Themochemical Tables, Fourth Edition, J. Phys. Chem. Ref. Data, Monograph 9, 1998, 1-1951. [all data]