Pentane, 3-ethyl-2,4-dimethyl-
- Formula: C9H20
- Molecular weight: 128.2551
- IUPAC Standard InChIKey: VLHAGZNBWKUMRW-UHFFFAOYSA-N
- CAS Registry Number: 1068-87-7
- Chemical structure:

Gas phase thermochemistry data

Data compiled by: Donald R. Burgess, Jr.
Quantity | Value | Units | Method | Reference | Comment |
---|---|---|---|---|---|
ΔfH°gas | -227.4 | kJ/mol | N/A | Good, 1969 | Value computed using ΔfHliquid° value of -269.7±0.92 kj/mol from Good, 1969 and ΔvapH° value of 42.3 kj/mol from missing citation. |

Condensed phase thermochemistry data

Data compiled by: Hussein Y. Afeefy, Joel F. Liebman, and Stephen E. Stein
Quantity | Value | Units | Method | Reference | Comment |
---|---|---|---|---|---|
ΔfH°liquid | -269.7 ± 0.92 | kJ/mol | Ccr | Good, 1969 | |
Quantity | Value | Units | Method | Reference | Comment |
ΔcH°liquid | -6130.19 ± 0.75 | kJ/mol | Ccr | Good, 1969 | Corresponding ΔfHºliquid = -269.7 kJ/mol (simple calculation by NIST; no Washburn corrections) |

Phase change data

Data compiled as indicated in comments:
TRC - Thermodynamics Research Center, NIST Boulder Laboratories, Chris Muzny director
AC - William E. Acree, Jr., James S. Chickos
Quantity | Value | Units | Method | Reference | Comment |
---|---|---|---|---|---|
Tboil | 409.81 | K | N/A | Anonymous, 1954 | Uncertainty assigned by TRC = 0.06 K; TRC |
Tboil | 409.15 | K | N/A | Bazhulin, Ukholin, et al., 1949 | Uncertainty assigned by TRC = 1.5 K; TRC |
Tboil | 409.75 | K | N/A | Fenske, Braun, et al., 1947 | Uncertainty assigned by TRC = 0.5 K; TRC |
Tboil | 409.86 | K | N/A | Howard, Mears, et al., 1947 | Uncertainty assigned by TRC = 0.1 K; TRC |
Quantity | Value | Units | Method | Reference | Comment |
Tfus | 150.75 ± 0.04 | K | AVG | N/A | Average of 6 values; Individual data points |
Quantity | Value | Units | Method | Reference | Comment |
ΔvapH° | 42.3 | kJ/mol | N/A | Reid, 1972 | See also Labbauf, Greenshields, et al., 1961.; AC |

Van Den Dool and Kratz RI, non-polar column, temperature ramp

Data compiled by: NIST Mass Spectrometry Data Center, William E. Wallace, director

Column type Capillary
Active phase OV-101
Column length (m) 108.
Carrier gas
Substrate
Column diameter (mm) 0.25
Phase thickness (μm) 0.2
Tstart (C) 35.
Tend (C) 200.
Heat rate (K/min) 1.
Initial hold (min)
Final hold (min)
I 833.
ReferenceHayes and Pitzer, 1981
Comment MSDC-RI

Normal alkane RI, non-polar column, isothermal

Data compiled by: NIST Mass Spectrometry Data Center, William E. Wallace, director

Column type Capillary
Active phase Methyl Silicone
Column length (m) 74.6
Carrier gas N2
Substrate
Column diameter (mm) 0.28
Phase thickness (μm)
Temperature (C) 50.
I 836.
ReferenceN/A
Comment MSDC-RI

Kovats' RI, non-polar column, isothermal

Data compiled by: NIST Mass Spectrometry Data Center, William E. Wallace, director

Column type CapillaryCapillaryCapillaryCapillaryCapillary
Active phase SqualaneSqualaneSqualaneSqualaneDB-1
Column length (m)   50.50.60.
Carrier gas   HeHe
Substrate
Column diameter (mm)   0.220.220.264
Phase thickness (μm)
Temperature (C) 100.25.50.70.60.
I 838.832.836.1840.838.2
ReferenceHeinzen, Soares, et al., 1999Hilal, Carreira, et al., 1994Lunskii and Paizanskaya, 1988Lunskii and Paizanskaya, 1988Lubeck and Sutton, 1983
Comment MSDC-RI MSDC-RI MSDC-RI MSDC-RI MSDC-RI
Column type CapillaryCapillaryCapillaryCapillaryCapillary
Active phase DB-1SqualaneSqualaneSqualaneSqualane
Column length (m) 60.  100.100.
Carrier gas    N2N2
Substrate
Column diameter (mm) 0.259  0.250.25
Phase thickness (μm) 1.
Temperature (C) 60.60.60.50.70.
I 838.5838.838.4836.840.
ReferenceLubeck and Sutton, 1983Chretien and Dubois, 1976Chretien and Dubois, 1976Rijks and Cramers, 1974Rijks and Cramers, 1974
Comment MSDC-RI MSDC-RI MSDC-RI MSDC-RI MSDC-RI
Column type CapillaryCapillaryCapillaryCapillary
Active phase SqualaneSqualaneSqualaneSqualane
Column length (m) 91.4100.100.100.
Carrier gas N2H2H2H2
Substrate
Column diameter (mm) 0.250.250.250.25
Phase thickness (μm)
Temperature (C) 60.30.50.70.
I 838.833.836.840.
ReferenceMatukuma, 1969Tourres, 1967Tourres, 1967Tourres, 1967
Comment MSDC-RI MSDC-RI MSDC-RI MSDC-RI

References

Good, 1969
Good, W.D.,
Enthalpies of combustion and formation of 11 isomeric nonanes,
J. Chem. Eng. Data, 1969, 14, 231-235. [all data]
Anonymous, 1954
Anonymous, R.,
Am. Pet. Inst. Res. Proj. 6, 1954, Carnegie-Mellon Univ., March 1954. [all data]
Bazhulin, Ukholin, et al., 1949
Bazhulin, P.A.; Ukholin, S.A.; Bulanova, T.F.; Koperina, A.V.; Plate, A.F.; Kazanskii, B.A.,
Izv. Akad. Nauk SSSR, 1949, 1949, 481. [all data]
Fenske, Braun, et al., 1947
Fenske, M.R.; Braun, W.G.; Wiegand, R.V.; Quiggle, D.; McCormick, R.H.; Rank, D.H.,
Raman Spectra of Hydrocarbons,
Anal. Chem., 1947, 19, 700. [all data]
Howard, Mears, et al., 1947
Howard, F.L.; Mears, T.W.; Fookson, A.; Pomerantz, P.; Brooks, D.B.,
Preparation and physical properties of several aliphatic hydrocarbons and intermediates,
J. Res. Natl. Bur. Stand. (U. S.), 1947, 38, 365. [all data]
Reid, 1972
Reid, Robert C.,
Handbook on vapor pressure and heats of vaporization of hydrocarbons and related compounds, R. C. Wilhort and B. J. Zwolinski, Texas A Research Foundation. College Station, Texas(1971). 329 pages.$10.00,
AIChE J., 1972, 18, 6, 1278-1278, https://doi.org/10.1002/aic.690180637
. [all data]
Labbauf, Greenshields, et al., 1961
Labbauf, A.; Greenshields, J.B.; Rossini, F.D.,
Heats of formation, combustion, and vaporization of the 35 nonanes and 75 decanes,
J. Chem. Eng. Data, 1961, 6, 261-263. [all data]