bis[μ-(2,2-dimethylpropanoato]tetramethyldigold

Phase change data

Data compiled by: William E. Acree, Jr., James S. Chickos

Enthalpy of sublimation

ΔsubH (kJ/mol) Temperature (K) Method Reference Comment
109.1 ± 2.1295. - 323.MEBessonov, Morozova, et al., 2008See also Bessonov, Morozova, et al., 2007.

References

Bessonov, Morozova, et al., 2008
Bessonov, A.A.; Morozova, N.B.; Semyannikov, P.P.; Trubin, S.V.; Gelfond, N.V.; Igumenov, I.K., Thermal behaviour of dimethylgold(III) carboxylates, J Therm Anal Calorim, 2008, 92, 3, 751-755, https://doi.org/10.1007/s10973-007-9172-7 . [all data]

Bessonov, Morozova, et al., 2007
Bessonov, A.A.; Morozova, N.B.; Gelfond, N.V.; Semyannikov, P.P.; Trubin, S.V.; Shevtsov, Yu.V.; Shubin, Yu.V.; Igumenov, I.K., Dimethylgold(III) carboxylates as new precursors for gold CVD, Surface and Coatings Technology, 2007, 201, 22-23, 9099-9103, https://doi.org/10.1016/j.surfcoat.2007.04.030 . [all data]