CsI2

Reaction thermochemistry data

Data compiled by: John E. Bartmess

Individual Reactions

Iodide + CsI2 = (Iodide • CsI2)

By formula: I- + CsI2 = (I- • CsI2)

Quantity Value Units Method Reference Comment
Δr115. ± 13.kJ/molN/AGusarov, Gorokhov, et al., 1979gas phase; value altered from reference due to conversion from electron convention to ion convention

Ion clustering data

Data compiled by: John E. Bartmess

Clustering reactions

Iodide + CsI2 = (Iodide • CsI2)

By formula: I- + CsI2 = (I- • CsI2)

Quantity Value Units Method Reference Comment
Δr27.6 ± 3.0kcal/molN/AGusarov, Gorokhov, et al., 1979gas phase; value altered from reference due to conversion from electron convention to ion convention

References

Gusarov, Gorokhov, et al., 1979
Gusarov, A.V.; Gorokhov, L.N.; Pyatenko, A.T.; Sidorova, I.V., Negative ions in the vapors of inorganic compounds, Adv. Mass Spectrom., 1979, 8, 262. [all data]