5-Heptenal, 2,6-dimethyl-

Normal alkane RI, polar column, temperature ramp

Data compiled by: NIST Mass Spectrometry Data Center, William E. Wallace, director

Column type CapillaryCapillaryCapillary
Active phase DB-WaxDB-WaxCarbowax 20M
Column length (m) 60.60.80.
Carrier gas  Helium
Substrate
Column diameter (mm) 0.250.250.2
Phase thickness (μm) 0.5
Tstart (C) 35.70.70.
Tend (C) 240.210.170.
Heat rate (K/min) 4.2.2.
Initial hold (min) 5.
Final hold (min) 10.60.
I 1389.1356.1358.
ReferenceChida, Sone, et al., 2004Mookdasanit, Tamura, et al., 2003Egolf and Jurs, 1993
Comment MSDC-RI MSDC-RI MSDC-RI

Kovats' RI, non-polar column, temperature ramp

Data compiled by: NIST Mass Spectrometry Data Center, William E. Wallace, director

Column type CapillaryCapillaryCapillary
Active phase DB-5DB-5Methyl Silicone
Column length (m) 30.30.12.
Carrier gas H2He
Substrate
Column diameter (mm) 0.250.250.5
Phase thickness (μm) 0.25
Tstart (C) 40.60.70.
Tend (C) 280.180.250.
Heat rate (K/min) 4.2.4.
Initial hold (min)
Final hold (min) 30. 15.
I 1060.1056.1037.7
ReferenceAvato, Raffo, et al., 2004Rao, Rout, et al., 2000Rao, Rajanikanth, et al., 1989
Comment MSDC-RI MSDC-RI MSDC-RI

Normal alkane RI, non-polar column, temperature ramp

Data compiled by: NIST Mass Spectrometry Data Center, William E. Wallace, director

Column type CapillaryCapillaryCapillaryCapillaryCapillary
Active phase Optima-5DB-5DB-5OV-101DB-1
Column length (m) 30.50.30.50.60.
Carrier gas Helium HeN2He
Substrate
Column diameter (mm) 0.250.30.250.250.25
Phase thickness (μm) 0.250.250.25 0.25
Tstart (C) 60.60.60.80.80.
Tend (C) 246.240.240.200.210.
Heat rate (K/min) 3.2.3.2.3.
Initial hold (min) 1.
Final hold (min)
I 1051.1054.1053.1036.1039.
ReferenceAl-Qudah, Muhaidat, et al., 2012Chagonda and Chalchat, 2005Chaverri and Cicció, 2005Yang, 2001Nishimura, 1995
Comment MSDC-RI MSDC-RI MSDC-RI MSDC-RI MSDC-RI
Column type CapillaryCapillaryCapillary
Active phase OV-101OV-101OV-101
Column length (m) 50.50.50.
Carrier gas
Substrate
Column diameter (mm) 0.220.250.25
Phase thickness (μm)
Tstart (C) 80.80.80.
Tend (C) 200.200.200.
Heat rate (K/min) 2.2.2.
Initial hold (min)
Final hold (min)
I 1039.1036.1039.
ReferenceEgolf and Jurs, 1993Tamura, Yang, et al., 1993Tamura, Yang, et al., 1993
Comment MSDC-RI MSDC-RI MSDC-RI

Normal alkane RI, non-polar column, custom temperature program

Data compiled by: NIST Mass Spectrometry Data Center, William E. Wallace, director

Column type CapillaryCapillaryCapillaryCapillaryCapillary
Active phase Siloxane, 5 % PhPolydimethyl siloxane, 5 % phenylDB-1 SE-30
Column length (m)   60.
Carrier gas   Helium
Substrate
Column diameter (mm)   0.25
Phase thickness (μm)   0.25
Program not specifiednot specified50 0C (5 min) 3 0C/min -> 120 0C 5 0C/min -> 250 0C (3 min) 15 0C/min -> 300 0C (20 min)not specifiednot specified
I 1047.1047.1037.1038.1039.
ReferenceVOC BinBase, 2012Skogerson, Wohlgemuth, et al., 2011Delort and Jaquier, 2009El-Shazily, Hafez, et al., 2004Vinogradov, 2004
Comment MSDC-RI MSDC-RI MSDC-RI MSDC-RI MSDC-RI

References

Chida, Sone, et al., 2004
Chida, M.; Sone, Y.; Tamura, H., Aroma characteristics of stored tobacco cut leaves analyzed by a high vacuum distillation and canister system, J. Agric. Food Chem., 2004, 52, 26, 7918-7924, https://doi.org/10.1021/jf049223p . [all data]

Mookdasanit, Tamura, et al., 2003
Mookdasanit, J.; Tamura, H.; Yoshizawa T.; Tokunaga T.; Nakanishi, K., Trace Volatile Compounds in Essential Oil of Citrus Sudachi by Means of Modified Solvent Extraction Method, Food Sci Technol. Res., 2003, 9, 1, 54-61, https://doi.org/10.3136/fstr.9.54 . [all data]

Egolf and Jurs, 1993
Egolf, L.M.; Jurs, P.C., Quantitative structure-retention and structure-odor intensity relationships for a diverse group of odor-active compounds, Anal. Chem., 1993, 65, 21, 3119-3126, https://doi.org/10.1021/ac00069a027 . [all data]