Hexanoic acid, methyl ester

Normal alkane RI, non-polar column, custom temperature program

Data compiled by: NIST Mass Spectrometry Data Center, William E. Wallace, director

Column type CapillaryCapillaryCapillaryCapillaryCapillary
Active phase Polydimethyl siloxane with 5 % Ph groupsPolydimethyl siloxane with 5 % Ph groupsSiloxane, 5 % PhVF-5 MSDB-5
Column length (m)    30.60.
Carrier gas    HeliumHelium
Substrate
Column diameter (mm)    0.250.25
Phase thickness (μm)    0.251.00
Program not specifiednot specifiednot specifiednot specified40 0C 4 0C/min -> 230 0C 100 0C/min -> 260 0C (11.7 min)
I 923.927.911.924.929.
ReferenceRobinson, Adams, et al., 2012Robinson, Adams, et al., 2012VOC BinBase, 2012Liu, Lu, et al., 2011Miyazaki, Plotto, et al., 2011
Comment MSDC-RI MSDC-RI MSDC-RI MSDC-RI MSDC-RI
Column type CapillaryCapillaryCapillaryCapillaryCapillary
Active phase Polydimethyl siloxane, 5 % phenylHP-5 MSHP-5HP-5HP-5
Column length (m)  30.60.30.30.
Carrier gas  HeliumHelium
Substrate
Column diameter (mm)  0.320.250.250.25
Phase thickness (μm)  0.250.250.250.25
Program not specifiednot specified30 0C (2 min) 2 0Cmin -> 60 0C 10 0C/min -> 100 0C 20 0C/min -> 140 0C 10 0C/min -> 200 0C (10 min)40 0C (2 min) 5 0C/min -> 80 0C 7 oC/min -> 160 0C 9 0C/min -> 200 0C 20 0C/min -> 280 0C (10 min)not specified
I 911.927.936.925.924.
ReferenceSkogerson, Wohlgemuth, et al., 2011Pino, Marquez, et al., 2010Rotsatschakul, Visesanguan, et al., 2009Zhao, Li, et al., 2008Zhao, Li, et al., 2008
Comment MSDC-RI MSDC-RI MSDC-RI MSDC-RI MSDC-RI
Column type CapillaryCapillaryCapillaryCapillaryCapillary
Active phase DB-5SPB-1LM-5LM-5SE-30
Column length (m) 30.30.30.30.
Carrier gas  HeHeliumHelium
Substrate
Column diameter (mm) 0.250.250.250.25
Phase thickness (μm) 0.250.25
Program 50C(1min) => 5C/min => 100C => 10C/min => 250C (9min)40C(10min) => 2C/min => 200C(1min) => 2C/min => 250C (10min)50 0C (10 min) 2 oC/min -> 75 0C 3 0C/min -> 150 0C 5 0C/min -> 200 0Cnot specifiednot specified
I 922.906.931.906.902.
ReferenceBeaulieu and Lancaster, 2007Bosch-Fuste, Riu-Aumatell, et al., 2007Janzanntti, Franco, et al., 2007Janzanntti, Franco, et al., 2007Liu, Liang, et al., 2007
Comment MSDC-RI MSDC-RI MSDC-RI MSDC-RI MSDC-RI
Column type CapillaryCapillaryCapillaryCapillaryCapillary
Active phase DB-5HP-5DB-5SE-30DB-1
Column length (m) 60.50.50. 30.
Carrier gas     H2
Substrate
Column diameter (mm) 0.250.320.32 0.25
Phase thickness (μm) 0.251.051.05 0.25
Program 50C => 5C/min => 100C => 15C/min => 250C (19C)40C(10min) => 5C/min => 200C => 20C/min => 250C(5min)40C(10min) => 5C/min => 200C => 20C/min => 250C (5min)not specified40C(10min) => 2C/min => 110C => 5C/min => 200C(10min)
I 922.926.926.906.911.
ReferenceBeaulieu, 2005Garcia-Estaban, Ansorena, et al., 2004Garcia-Estaban, Ansorena, et al., 2004, 2Vinogradov, 2004Alves and Franco, 2003
Comment MSDC-RI MSDC-RI MSDC-RI MSDC-RI MSDC-RI
Column type CapillaryCapillaryCapillaryCapillaryCapillary
Active phase HP-5DB-5HP-5HP-5HP-1
Column length (m) 30.30.30.30.50.
Carrier gas     N2
Substrate
Column diameter (mm) 0.250.320.250.250.32
Phase thickness (μm) 0.251.0.250.250.52
Program 40C(6min) => 2.5C/min => 150C => 90C/min => 250C35C(4min) => 2C/min => 130C => 4C/min => 250Cnot specified40C (6min) => 2.5C/min => 150C => 90C/min => 250C40C => 2C/min => 130C => 4C/min => 250C
I 934.934.934.934.906.
ReferenceJordán, Margaría, et al., 2003Qian and Reineccius, 2003Jordán, Goodner, et al., 2002Jordán, Margaría, et al., 2002Teai, Claude-Lafontaine, et al., 2001
Comment MSDC-RI MSDC-RI MSDC-RI MSDC-RI MSDC-RI
Column type CapillaryCapillaryCapillaryCapillaryCapillary
Active phase Methyl SiliconeDB-1CP Sil 5 CB5 % Phenyl methyl siloxaneDB-1
Column length (m)  60.25. 30.
Carrier gas  N2He
Substrate
Column diameter (mm)  0.32  0.25
Phase thickness (μm)  0.25  0.25
Program not specified40 0C (10 min) 40 - 80 0C at 2 0C/min 80 - 200 0C at 5 0C/min 200 0C (10 min)not specifiednot specifiednot specified
I 907.902.914.904.906.
ReferenceEstrada and Gutierrez, 1999Yen and Lin, 1999Weyerstahl, Marschall, et al., 1998Sagrero-Nieves and Bartley, 1995Marlatt, Ho, et al., 1992
Comment MSDC-RI MSDC-RI MSDC-RI MSDC-RI MSDC-RI
Column type CapillaryCapillaryCapillary
Active phase DB-1DB-1OV-101
Column length (m) 30.30.25.
Carrier gas H2H2He
Substrate
Column diameter (mm) 0.250.250.31
Phase thickness (μm) 0.250.25
Program 30C (2min) => 2C/min => 150C => 4C/min => 250C30C (2min) => 2C/min => 150C => 4C/min => 250Cnot specified
I 905.906.906.
ReferenceTakeoka, Flath, et al., 1988Takeoka, Flath, et al., 1988Morales and Duque, 1987
Comment MSDC-RI MSDC-RI MSDC-RI

Van Den Dool and Kratz RI, non-polar column, temperature ramp

Data compiled by: NIST Mass Spectrometry Data Center, William E. Wallace, director

Column type CapillaryCapillaryCapillaryCapillaryCapillary
Active phase SPB-5DB-5DB-5HP-5MSDB-5MS
Column length (m) 30.30.30.30.30.
Carrier gas HeHe He
Substrate
Column diameter (mm) 0.250.320.250.250.25
Phase thickness (μm) 0.250.251.0.250.25
Tstart (C) 50.40.50.60.40.
Tend (C) 220.250.290.250.200.
Heat rate (K/min) 20.5.10.4.10.
Initial hold (min) 2.2.1.2.3.
Final hold (min) 2.5.10.20.20.
I 925.915.936.924.938.
ReferenceBalbontin, Gaete-Eastman, et al., 2007Wu, Zorn, et al., 2007Bylaite and Meyer, 2006Pino, Mesa, et al., 2005Whetstine, Cadwallader, et al., 2005
Comment MSDC-RI MSDC-RI MSDC-RI MSDC-RI MSDC-RI
Column type CapillaryCapillaryCapillaryCapillaryCapillary
Active phase DB-5SPB-5CP Sil 5 CBSPB-5CP Sil 8 CB
Column length (m) 30.30.60.30.60.
Carrier gas HeHeHeHeHe
Substrate
Column diameter (mm) 0.320.250.320.250.25
Phase thickness (μm) 0.250.250.250.250.25
Tstart (C) 40.60.60.60.40.
Tend (C) 250.250.280.250.280.
Heat rate (K/min) 5.4.3.4.4.
Initial hold (min) 2.2.10.2.2.
Final hold (min) 5.20.60.20.
I 911.925.903.923.926.
ReferenceWu, Zorn, et al., 2005Píno, Marbot, et al., 2004Pino, Almora, et al., 2003Pino, Marbot, et al., 2003Elmore, Campo, et al., 2002
Comment MSDC-RI MSDC-RI MSDC-RI MSDC-RI MSDC-RI
Column type CapillaryCapillaryCapillaryCapillaryCapillary
Active phase SPB-5CP Sil 5 CBCP-Sil 8CB-MSSPB-1CP Sil 5 CB
Column length (m) 30.50.60.30.50.
Carrier gas HeHe HeHe
Substrate
Column diameter (mm) 0.250.320.250.320.32
Phase thickness (μm) 0.250.40.254.0.4
Tstart (C) 60.60.40.45.60.
Tend (C) 250.280.280.240.280.
Heat rate (K/min) 4.3.4.5.3.
Initial hold (min) 2.10.2.13.10.
Final hold (min) 20.60. 5.60.
I 933.904.934.905.904.
ReferencePino, Marbot, et al., 2002Pino, Marbot, et al., 2002, 2Bruna, Hierro, et al., 2001Larráyoz, Addis, et al., 2001Pino and Marbot, 2001
Comment MSDC-RI MSDC-RI MSDC-RI MSDC-RI MSDC-RI
Column type CapillaryCapillaryCapillaryCapillaryCapillary
Active phase CP Sil 5 CBDB-1OV-101SE-30DB-1
Column length (m) 50.30.50.25.25.
Carrier gas HeH2HeHeHe
Substrate
Column diameter (mm) 0.320.320.250.320.2
Phase thickness (μm) 0.40.250.251.0.11
Tstart (C) 60.40.140.140.50.
Tend (C) 280.245.  250.
Heat rate (K/min) 3.3.8.8.5.
Initial hold (min) 10.3.
Final hold (min) 60.20.
I 904.904.908.5907.4908.
ReferencePino, Marbot, et al., 2001Brat, Brillouet, et al., 2000Golovnya, Syomina, et al., 1997Grigor'eva, Golovnya, et al., 1997Warthen, Lee, et al., 1997
Comment MSDC-RI MSDC-RI MSDC-RI MSDC-RI MSDC-RI
Column type CapillaryCapillaryCapillaryCapillaryPacked
Active phase DB-1DB-1BP-1DB-5OV-101
Column length (m) 25.60.12.30.2.5
Carrier gas He H2He
Substrate     Gas-Chrom Q
Column diameter (mm) 0.20.32 0.26
Phase thickness (μm) 0.11  0.25
Tstart (C) 50.50.40.50.50.
Tend (C) 250.250.240.300.220.
Heat rate (K/min) 5.4.4.6.2.
Initial hold (min)  0.12.4.
Final hold (min)   75.20.
I 908.906.909.927.910.
ReferenceWarthen, Lee, et al., 1997Flath, Light, et al., 1990Tan, Wilkins, et al., 1989Rostad and Pereira, 1986Nixon, Wong, et al., 1979
Comment MSDC-RI MSDC-RI MSDC-RI MSDC-RI MSDC-RI
Column type Packed
Active phase SE-30
Column length (m)
Carrier gas
Substrate Celite
Column diameter (mm)
Phase thickness (μm)
Tstart (C) 75.
Tend (C) 228.
Heat rate (K/min)
Initial hold (min)
Final hold (min)
I 907.
Referencevan den Dool and Kratz, 1963
Comment MSDC-RI

Phase change data

Data compiled as indicated in comments:
BS - Robert L. Brown and Stephen E. Stein
TRC - Thermodynamics Research Center, NIST Boulder Laboratories, Chris Muzny director
AC - William E. Acree, Jr., James S. Chickos
ALS - Hussein Y. Afeefy, Joel F. Liebman, and Stephen E. Stein
DRB - Donald R. Burgess, Jr.

Quantity Value Units Method Reference Comment
Tboil423. ± 1.KAVGN/AAverage of 8 values; Individual data points
Quantity Value Units Method Reference Comment
Tfus203.6KN/AAdriaanse, Dekker, et al., 1964Uncertainty assigned by TRC = 0.05 K; TRC
Tfus202.2KN/ABilterys and Gisseleire, 1935Uncertainty assigned by TRC = 0.5 K; TRC
Quantity Value Units Method Reference Comment
Δvap48. ± 1.kJ/molAVGN/AAverage of 10 values; Individual data points

Reduced pressure boiling point

Tboil (K) Pressure (bar) Reference Comment
325.20.020Weast and Grasselli, 1989BS

Enthalpy of vaporization

ΔvapH (kJ/mol) Temperature (K) Method Reference Comment
45.2350.N/Avan Genderen, van Miltenburg, et al., 2002AC
46.4 ± 0.1325.N/Avan Genderen, van Miltenburg, et al., 2002AC
45.3330.AStephenson and Malanowski, 1987Based on data from 315. - 383. K. See also Rose and Schrodt, 1963.; AC

Antoine Equation Parameters

log10(P) = A − (B / (T + C))
    P = vapor pressure (bar)
    T = temperature (K)

View plot Requires a JavaScript / HTML 5 canvas capable browser.

Temperature (K) A B C Reference Comment
317.7 - 378.04.954091935.423-31.421Rose and Supina, 1961Coefficents calculated by NIST from author's data.
288. - 343.5.02082014.087-23.036Althouse and Triebold, 1944Coefficents calculated by NIST from author's data.

In addition to the Thermodynamics Research Center (TRC) data available from this site, much more physical and chemical property data is available from the following TRC products:

Condensed phase thermochemistry data

Data compiled by: Hussein Y. Afeefy, Joel F. Liebman, and Stephen E. Stein

Quantity Value Units Method Reference Comment
Δfliquid-540.2 ± 1.0kJ/molCcbAdriaanse, Dekker, et al., 1965Heat of formation derived by Cox and Pilcher, 1970
Quantity Value Units Method Reference Comment
Δcliquid-4184.0 ± 0.4kJ/molCcbFreedman, Bagby, et al., 1989Corresponding Δfliquid = -571.5 kJ/mol (simple calculation by NIST; no Washburn corrections)
Δcliquid-4215.0 ± 0.6kJ/molCcbAdriaanse, Dekker, et al., 1965Corresponding Δfliquid = -540.4 kJ/mol (simple calculation by NIST; no Washburn corrections)

Gas phase thermochemistry data

Data compiled by: Hussein Y. Afeefy, Joel F. Liebman, and Stephen E. Stein

Quantity Value Units Method Reference Comment
Δfgas-494. ± 2.kJ/molCcbAdriaanse, Dekker, et al., 1965Heat of formation derived by Cox and Pilcher, 1970

Normal alkane RI, non-polar column, temperature ramp

Data compiled by: NIST Mass Spectrometry Data Center, William E. Wallace, director

Column type CapillaryCapillaryCapillaryCapillaryCapillary
Active phase DB-5VF-5 MSHP-5 MSRTX-5DB-5
Column length (m) 30.30.30.10.30.
Carrier gas HeliumHeliumHeliumHeHe
Substrate
Column diameter (mm) 0.250.250.320.180.32
Phase thickness (μm) 0.250.250.250.20.25
Tstart (C) 60.40.50.40.40.
Tend (C) 240.250.240.275.250.
Heat rate (K/min) 3.5.4.50.4.
Initial hold (min)  3.2.0.52.
Final hold (min)  3.10.0.55.
I 919.927.930.929.924.
ReferenceFraternale, Ricci, et al., 2011Liu, Lu, et al., 2011Pino, Marquez, et al., 2010Setkova, Risticevic, et al., 2007Xu, Fan, et al., 2007
Comment MSDC-RI MSDC-RI MSDC-RI MSDC-RI MSDC-RI
Column type CapillaryCapillaryCapillaryCapillaryCapillary
Active phase DB-5DB-5HP-5MSDB-5HP-5
Column length (m) 30.30.30.30.60.
Carrier gas HeN2HeN2He
Substrate
Column diameter (mm) 0.320.320.250.320.32
Phase thickness (μm) 1.1.0.250.250.25
Tstart (C) 40.40.50.40.30.
Tend (C) 250.230.250.250.260.
Heat rate (K/min) 4.6.4.4.2.
Initial hold (min) 2.2. 2.2.
Final hold (min) 15.15. 5.28.
I 924.928.925.924.923.2
ReferenceFan and Qian, 2006Fan and Qian, 2006, 2Hadaruga, Hadaruga, et al., 2006Fan and Qian, 2005Leffingwell and Alford, 2005
Comment MSDC-RI MSDC-RI MSDC-RI MSDC-RI MSDC-RI
Column type CapillaryCapillaryCapillaryCapillaryCapillary
Active phase HP-5MSHP-5HP-5HP-5HP-5
Column length (m) 30.30.30.30.25.
Carrier gas HeHeliumHeliumHeliumHe
Substrate
Column diameter (mm) 0.250.320.320.320.2
Phase thickness (μm) 0.250.250.250.250.33
Tstart (C) 60.40.40.40.40.
Tend (C) 285.250.250.250.190.
Heat rate (K/min) 4.35.5.5.4.
Initial hold (min)  2.2.2.
Final hold (min)  5.5.5.5.
I 927.915.936.936.909.
ReferenceTesevic, Nikicevic, et al., 2005N/AN/AN/AAzodanlou, Darbellay, et al., 2003
Comment MSDC-RI MSDC-RI MSDC-RI MSDC-RI MSDC-RI
Column type CapillaryCapillaryCapillaryCapillaryCapillary
Active phase SPB-5HP-5Methyl SiliconeDB-1Ultra-1
Column length (m) 30.30.50.30.50.
Carrier gas HeH2H2HeHe
Substrate
Column diameter (mm) 0.320.250.250.250.31
Phase thickness (μm) 0.250.250.5 0.17
Tstart (C) 40.40.40.70.30.
Tend (C) 220.280.260.300.210.
Heat rate (K/min) 5.3.4.3.2.
Initial hold (min) 1.10.0.55.4.
Final hold (min) 20.10.
I 927.927.906.905.910.
ReferenceLedauphin, Guichard, et al., 2003Bicalho, Pereira, et al., 2000Vendramini and Trugo, 2000Guy and Vernin, 1996Iwaoka, Zhang, et al., 1993
Comment MSDC-RI MSDC-RI MSDC-RI MSDC-RI MSDC-RI
Column type CapillaryCapillaryCapillaryCapillaryCapillary
Active phase DB-1DB-1DB-1DB-1OV-101
Column length (m) 30.30.60.60.50.
Carrier gas HeHeHeHe
Substrate
Column diameter (mm) 0.250.250.250.250.28
Phase thickness (μm) 1.01.00.250.25
Tstart (C) 40.40.50.50.80.
Tend (C) 250.250.240.240.200.
Heat rate (K/min) 3.3.3.3.2.
Initial hold (min)
Final hold (min) 30.30.
I 906.906.907.907.906.
ReferencePeppard, 1992Peppard, 1992Shiota, 1991Shiota, 1991Anker, Jurs, et al., 1990
Comment MSDC-RI MSDC-RI MSDC-RI MSDC-RI MSDC-RI
Column type CapillaryCapillaryCapillaryCapillaryCapillary
Active phase DB-1DB-1DB-1DB-1OV-101
Column length (m) 60.60.50.50.50.
Carrier gas HeHe
Substrate
Column diameter (mm) 0.320.320.320.320.32
Phase thickness (μm)
Tstart (C) 30.30.0.50.40.
Tend (C) 210.210.250.250.225.
Heat rate (K/min) 2.2.3.3.4.
Initial hold (min) 4.4.  0.1
Final hold (min)     30.
I 910.914.906.907.907.
ReferenceTakeoka and Butter, 1989Takeoka and Butter, 1989Habu, Flath, et al., 1985Habu, Flath, et al., 1985Stern, Flath, et al., 1985
Comment MSDC-RI MSDC-RI MSDC-RI MSDC-RI MSDC-RI
Column type CapillaryCapillaryCapillaryCapillary
Active phase OV-101SE-30SE-30OV-1
Column length (m) 50.200. 183.
Carrier gas  N2HeliumN2
Substrate
Column diameter (mm) 0.320.6 0.762
Phase thickness (μm)
Tstart (C) 50.20.70.0.
Tend (C) 225.220.170.230.
Heat rate (K/min) 4.2.2.1.
Initial hold (min) 0.1
Final hold (min) 30.
I 905.906.921.906.
ReferenceStern, Flath, et al., 1985Dirinck, de Pooter, et al., 1981Alves and Jennings, 1979Schreyen, Dirinck, et al., 1979
Comment MSDC-RI MSDC-RI MSDC-RI MSDC-RI

Reaction thermochemistry data

Data compiled by: Hussein Y. Afeefy, Joel F. Liebman, and Stephen E. Stein

Individual Reactions

2Hydrogen + methyl hex-2-ynoate = Hexanoic acid, methyl ester

By formula: 2H2 + C7H10O2 = C7H14O2

Quantity Value Units Method Reference Comment
Δr-71.1 ± 1.2kcal/molChydFlitcroft and Skinner, 1958liquid phase

References

Robinson, Adams, et al., 2012
Robinson, A.L.; Adams, D.O.; Boss, P.K.; Heymann, H.; Solomon, P.S.; Trengove, R.D., Influence of geographic origine on the sensory characteristics and wine composition of Vitus viniferas cv. Cabernet Sauvignon wines from Australia (Supplemental data), Am. J. Enol. Vitic., 2012, 64, 4, 467-476, https://doi.org/10.5344/ajev.2012.12023 . [all data]

VOC BinBase, 2012
VOC BinBase, The volatile compound BinBase (VOC BinBase), 2012, retrieved from http://fiehnlab.ucdavis.edu/projects/VocBinBase and http://binbase.sourceforge.net. [all data]

Liu, Lu, et al., 2011
Liu, S.; Lu, S.; Su, Y.; Guo, Y., Analysis of volatile compounds in Radix Bupleuri injection by GC-MS-MS, Chromatographia, 2011, 74, 5-6, 497-502, https://doi.org/10.1007/s10337-011-2082-7 . [all data]

Miyazaki, Plotto, et al., 2011
Miyazaki, T.; Plotto, A.; Goodner, K.; Gmitter F.G., Distribution of aroma volatile compounds in tangerine hybrids and proposed inheritance, J. Sci. Food Agric., 2011, 91, 3, 449-460, https://doi.org/10.1002/jsfa.4205 . [all data]

Skogerson, Wohlgemuth, et al., 2011
Skogerson, K.; Wohlgemuth, G.; Fiehn, O., VocBinNase, 2011, retrieved from http://fiehnlab.ucdavis.edu/projects//VocBinBase. [all data]

Pino, Marquez, et al., 2010
Pino, J.A.; Marquez, E.; Quijano, C.E.; Castro, D., Volatile compounds in noni (Morinda citrifolia L.) at two ripening stages, Ciencia e Technologia de Alimentos, 2010, 30, 1, 183-187, https://doi.org/10.1590/S0101-20612010000100028 . [all data]

Rotsatschakul, Visesanguan, et al., 2009
Rotsatschakul, P.; Visesanguan, W.; Smitinont, T.; Chaiseri, S., Changes in volatile compounds during fermentation of nham (Thai fermented sausage), Int. Food Res. J., 2009, 16, 391-414. [all data]

Zhao, Li, et al., 2008
Zhao, Y.; Li, J.; Xu, Y.; Duan, H.; Fan, W.; Zhao, G., EXtraction, preparation and identification of volatile compounds in Changyu XO brandy, Chinese J. Chromatogr., 2008, 26, 2, 212-222, https://doi.org/10.1016/S1872-2059(08)60014-0 . [all data]

Beaulieu and Lancaster, 2007
Beaulieu, J.C.; Lancaster, V.A., Correlating Volatile Compounds, Sensory Attributes, and Quality Parameters in Stored Fresh-Cut Cantaloupe, J. Agric. Food Chem., 2007, 55, 23, 9503-9513, https://doi.org/10.1021/jf070282n . [all data]

Bosch-Fuste, Riu-Aumatell, et al., 2007
Bosch-Fuste, J.; Riu-Aumatell, M.; Guadayol, J.M.; Caixach, J.; Lopez-Tamames, E.; Buxaderas, S., Volatile profiles of sparkling wines obtained by three extraction methods and gas chromatography-mass spectrometry (GC-MS) analysis, Food Chem., 2007, 105, 1, 428-435, https://doi.org/10.1016/j.foodchem.2006.12.053 . [all data]

Janzanntti, Franco, et al., 2007
Janzanntti, N.S.; Franco, M.R.B.; Lancas, F.M., Identificacao de compostos volateis de macas (Malus domestica) cultivar fuji, por chromatoghrafia gasosa-espectrometria de massas, 2007, retrieved from http://www.bibvirt.futuro.nsp.br/content/download/7005/56300/file/cta20u26.pdf. [all data]

Liu, Liang, et al., 2007
Liu, F.; Liang, Y.; Cao, C.; Zhou, N., QSPR study of GC retention indices for saturated esters on seven stationary phases based on novel topological indices, Talanta, 2007, 72, 4, 1307-1315, https://doi.org/10.1016/j.talanta.2007.01.038 . [all data]

Beaulieu, 2005
Beaulieu, J.C., Within-Season Volatile and Quality Differences in Stored Fresh-Cut Cantaloupe Cultivars, J. Agric. Food Chem., 2005, 53, 22, 8679-8687, https://doi.org/10.1021/jf050241w . [all data]

Garcia-Estaban, Ansorena, et al., 2004
Garcia-Estaban, M.; Ansorena, D.; Astiasaran, I.; Martin, D.; Ruiz, J., Comparison of simultaneous distillation extraction (SDE) and solid-phase microextraction (SPME) for the analysis of volatile compounds in dry-cured ham, J. Sci. Food Agric., 2004, 84, 11, 1364-1370, https://doi.org/10.1002/jsfa.1826 . [all data]

Garcia-Estaban, Ansorena, et al., 2004, 2
Garcia-Estaban, M.; Ansorena, D.; Astiasarán, I.; Ruiz, J., Study of the effect of different fiber coatings and extraction conditions on dry cured ham volatile compounds extracted by solid-phase microextraction (SPME), Talanta, 2004, 64, 2, 458-466, https://doi.org/10.1016/j.talanta.2004.03.007 . [all data]

Vinogradov, 2004
Vinogradov, B.A., Production, composition, properties and application of essential oils, 2004, retrieved from http://viness.narod.ru. [all data]

Alves and Franco, 2003
Alves, G.L.; Franco, M.R.B., Headspace gas chromatography-mass spectrometry of volatile compounds in murici (Byrsonima crassifolia L. Rich), J. Chromatogr. A, 2003, 985, 1-2, 297-301, https://doi.org/10.1016/S0021-9673(02)01398-5 . [all data]

Jordán, Margaría, et al., 2003
Jordán, M.J.; Margaría, C.A.; Shaw, P.E.; Goodner, K.L., Volatile components and aroma active compounds in aqueous essence and fresh pink guava fruid puree (Psidium guajava L.) by GC-MS and multidimensional GC/GC-O, J. Agric. Food Chem., 2003, 51, 5, 1421-1426, https://doi.org/10.1021/jf020765l . [all data]

Qian and Reineccius, 2003
Qian, M.; Reineccius, G., Potent aroma compounds in Parmigiano Reggiano cheese studied using a dynamic headspace (purge-trap) method, Flavour Fragr. J., 2003, 18, 3, 252-259, https://doi.org/10.1002/ffj.1194 . [all data]

Jordán, Goodner, et al., 2002
Jordán, M.J.; Goodner, K.L.; Shaw, P.E., Characterization of the aromatic profile in aqueous essence and fruit juice of yellow passion fruit (Passiflora edulis Sims F. Flavicarpa degner) by GC-MS and GC/O, J. Agric. Food Chem., 2002, 50, 6, 1523-1528, https://doi.org/10.1021/jf011077p . [all data]

Jordán, Margaría, et al., 2002
Jordán, M.J.; Margaría, C.A.; Shaw, P.E.; Goodner, K.L., Aroma active components in aqueous kiwi fruit essence and kiwi fruit puree by GC-MS and multidimensional GC/GC-O, J. Agric. Food Chem., 2002, 50, 19, 5386-5390, https://doi.org/10.1021/jf020297f . [all data]

Teai, Claude-Lafontaine, et al., 2001
Teai, T.; Claude-Lafontaine, A.; Schippa, C.; Cozzolino, F., Volatile compounds in fresh pulp of pineapple (Ananas comosus [L.] Merr.) from French Polynesia, J. Essent. Oil Res., 2001, 13, 5, 314-318, https://doi.org/10.1080/10412905.2001.9712222 . [all data]

Estrada and Gutierrez, 1999
Estrada, E.; Gutierrez, Y., Modeling chromatographic parameters by a novel graph theoretical sub-structural approach, J. Chromatogr. A, 1999, 858, 2, 187-199, https://doi.org/10.1016/S0021-9673(99)00808-0 . [all data]

Yen and Lin, 1999
Yen, G.-C.; Lin, H.-T., Changes in volatile flavor components of guava juice with high-pressure treatment and heat processing and during storage, J. Agric. Food Chem., 1999, 47, 5, 2082-2087, https://doi.org/10.1021/jf9810057 . [all data]

Weyerstahl, Marschall, et al., 1998
Weyerstahl, P.; Marschall, H.; Weirauch, M.; Thefeld, K.; Surburg, H., Constituents of commercial Labdanum oil, Flavour Fragr. J., 1998, 13, 5, 295-318, https://doi.org/10.1002/(SICI)1099-1026(1998090)13:5<295::AID-FFJ751>3.0.CO;2-I . [all data]

Sagrero-Nieves and Bartley, 1995
Sagrero-Nieves, L.; Bartley, J.P., Volatile Constituents from the Leaves of Chenopodium ambrosioides L., J. Essent. Oil Res., 1995, 7, 2, 221-223, https://doi.org/10.1080/10412905.1995.9698506 . [all data]

Marlatt, Ho, et al., 1992
Marlatt, C.; Ho, C.-T.; Chien, M., Studies of aroma constituents bound as glycosides in tomato, J. Agric. Food Chem., 1992, 40, 2, 249-252, https://doi.org/10.1021/jf00014a016 . [all data]

Takeoka, Flath, et al., 1988
Takeoka, G.R.; Flath, R.A.; Güntert, M.; Jennings, W., Nectarine volatiles: vacuum steam distillation versus headspace sampling, J. Agric. Food Chem., 1988, 36, 3, 553-560, https://doi.org/10.1021/jf00081a037 . [all data]

Morales and Duque, 1987
Morales, A.L.; Duque, C., Aroma constituents of the fruit of the moutain papaya (Carica pubescens) from Colombia, J. Agric. Food Chem., 1987, 35, 4, 538-540, https://doi.org/10.1021/jf00076a024 . [all data]