hexabenzo[a,d,g,j,m,p]coronene

Gas phase ion energetics data

Data compiled as indicated in comments:
LLK - Sharon G. Lias, Rhoda D. Levin, and Sherif A. Kafafi

Ionization energy determinations

IE (eV) Method Reference Comment
6.75PEClar and Schmidt, 1977LLK
6.75PEClar and Schmidt, 1977Vertical value; LLK
6.78PEClar and Schmidt, 1976Vertical value; LLK

References

Clar and Schmidt, 1977
Clar, E.; Schmidt, W., Correlations between photoelectron and ultraviolet absorption spectra of polycyclic hydrocarbons. The perylene, coronene and bisanthene series, Tetrahedron, 1977, 33, 2093. [all data]

Clar and Schmidt, 1976
Clar, E.; Schmidt, W., Correlations between photoelectron and phosphorescence spectra of polycyclic hydrocarbons, Tetrahedron, 1976, 32, 2563. [all data]