Bicyclo[2.2.2]oct-2-ene, 5-(1-methylethyl)-, (1α,4α,5β)-

Gas phase thermochemistry data

Data compiled by: Hussein Y. Afeefy, Joel F. Liebman, and Stephen E. Stein

Quantity Value Units Method Reference Comment
Δfgas-51.9 ± 4.2kJ/molKinVan Mele, Boon, et al., 1986

References

Van Mele, Boon, et al., 1986
Van Mele, B.; Boon, G.; Huybrechts, G., Gas-phase kinetic and thermochemical data for endo- and exo-5-monosubstituted bicyclo[2.2.2]oct-2-enes, Int. J. Chem. Kinet., 1986, 18, 537-545. [all data]