CAS Reg. No. 106389-62-2

Reaction thermochemistry data

Data compiled by: John E. Bartmess

Individual Reactions

(CAS Reg. No. 106389-62-2 • 4294967295silicon) + silicon = CAS Reg. No. 106389-62-2

By formula: (CAS Reg. No. 106389-62-2 • 4294967295Si) + Si = CAS Reg. No. 106389-62-2

Quantity Value Units Method Reference Comment
Δr112.2 ± 8.2kcal/molN/AXu, Taylor, et al., 1998gas phase

References

Xu, Taylor, et al., 1998
Xu, C.S.; Taylor, T.R.; Burton, G.R.; Neumark, D.M., Vibrationally reserved photoelectron spectroscopy of silicon cluster anions Si-n(-) (n=3-7), J. Chem. Phys., 1998, 108, 4, 1395-1406, https://doi.org/10.1063/1.475511 . [all data]