C27H27F3O

Reaction thermochemistry data

Data compiled by: John E. Bartmess

Individual Reactions

C27H26F3O- + Hydrogen cation = C27H27F3O

By formula: C27H26F3O- + H+ = C27H27F3O

Quantity Value Units Method Reference Comment
Δr329.7 ± 2.5kcal/molG+TSMishima, Mustanir, et al., 2000gas phase; Keto acidity; enol acidity=323.4: 323 K
Quantity Value Units Method Reference Comment
Δr322.6 ± 2.0kcal/molIMREMishima, Mustanir, et al., 2000gas phase; Keto acidity; enol acidity=323.4: 323 K

Gas phase ion energetics data

Data compiled by: John E. Bartmess

De-protonation reactions

C27H26F3O- + Hydrogen cation = C27H27F3O

By formula: C27H26F3O- + H+ = C27H27F3O

Quantity Value Units Method Reference Comment
Δr329.7 ± 2.5kcal/molG+TSMishima, Mustanir, et al., 2000gas phase; Keto acidity; enol acidity=323.4: 323 K
Quantity Value Units Method Reference Comment
Δr322.6 ± 2.0kcal/molIMREMishima, Mustanir, et al., 2000gas phase; Keto acidity; enol acidity=323.4: 323 K

References

Mishima, Mustanir, et al., 2000
Mishima, M.; Mustanir; Eventova, I.; Rappoport, Z., Acidities and pK(Enol) values of stable simple enols in the gas phase, J. Chem. Soc. Perkin Trans., 2000, 2, 7, 1505-1512, https://doi.org/10.1039/b001155j . [all data]